CRAN Package Check Results for Package xts

Last updated on 2021-09-20 12:59:57 CEST.

Flavor Version Tinstall Tcheck Ttotal Status Flags
r-devel-linux-x86_64-debian-clang 0.12.1 15.81 82.76 98.57 OK
r-devel-linux-x86_64-debian-gcc 0.12.1 9.98 62.20 72.18 ERROR
r-devel-linux-x86_64-fedora-clang 0.12.1 124.92 ERROR
r-devel-linux-x86_64-fedora-gcc 0.12.1 113.13 ERROR
r-devel-windows-x86_64 0.12.1 25.00 91.00 116.00 ERROR
r-devel-windows-x86_64-gcc10-UCRT 0.12.1 ERROR
r-patched-linux-x86_64 0.12.1 14.36 79.86 94.22 OK
r-patched-solaris-x86 0.12.1 199.00 OK
r-release-linux-x86_64 0.12.1 13.81 79.16 92.97 OK
r-release-macos-arm64 0.12.1 OK
r-release-macos-x86_64 0.12.1 OK
r-release-windows-ix86+x86_64 0.12.1 48.00 117.00 165.00 OK
r-oldrel-macos-x86_64 0.12.1 OK
r-oldrel-windows-ix86+x86_64 0.12.1 45.00 113.00 158.00 OK

Check Details

Version: 0.12.1
Check: tests
Result: ERROR
     Running ‘doRUnit.R’ [7s/10s]
    Running the tests in ‘tests/doRUnit.R’ failed.
    Complete output:
     > ## unit tests will not be done if RUnit is not available
     > if(require("RUnit", quietly=TRUE)) {
     +
     + ## --- Setup ---
     + R_CMD_CHECK <- Sys.getenv("RCMDCHECK") != "FALSE"
     +
     + pkg <- "xts" # <-- Change to package name!
     + if (R_CMD_CHECK) {
     + ## Path to unit tests for R CMD check
     + ## PKG.Rcheck/tests/../PKG/unitTests
     + path <- system.file(package=pkg, "unitTests")
     + } else {
     + ## Path to unit tests for standalone running under Makefile (not R CMD check)
     + ## PKG/tests/../inst/unitTests
     + path <- file.path(getwd(), "..", "inst", "unitTests")
     + }
     + cat("\nRunning unit tests\n")
     + print(list(pkg=pkg, getwd=getwd(), pathToUnitTests=path))
     +
     + library(package=pkg, character.only=TRUE)
     +
     + ## If desired, load the name space to allow testing of private functions
     + ## if (is.element(pkg, loadedNamespaces()))
     + ## attach(loadNamespace(pkg), name=paste("namespace", pkg, sep=":"), pos=3)
     + ##
     + ## or simply call PKG:::myPrivateFunction() in tests
     +
     + ## --- Testing ---
     +
     + ## Define tests
     + testSuite <- defineTestSuite(name=paste(pkg, "unit testing"),
     + dirs=path)
     + ## Run
     + tests <- runTestSuite(testSuite)
     +
     + ## Report to stdout
     + cat("------------------- UNIT TEST SUMMARY ---------------------\n\n")
     + printTextProtocol(tests, showDetails=FALSE)
     +
     + ## Report text files (only if not under R CMD check)
     + if (!R_CMD_CHECK) {
     + ## Default report name
     + pathReport <- file.path(path, "report")
     +
     + printTextProtocol(tests, showDetails=FALSE,
     + fileName=paste(pathReport, "Summary.txt", sep=""))
     + printTextProtocol(tests, showDetails=TRUE,
     + fileName=paste(pathReport, ".txt", sep=""))
     +
     + ## Report to HTML file
     + printHTMLProtocol(tests, fileName=paste(pathReport, ".html", sep=""))
     + }
     +
     + ## Return stop() to cause R CMD check stop in case of
     + ## - failures i.e. FALSE to unit tests or
     + ## - errors i.e. R errors
     + tmp <- getErrors(tests)
     + if(tmp$nFail > 0 | tmp$nErr > 0) {
     + stop(paste("\n\nunit testing failed (#test failures: ", tmp$nFail,
     + ", #R errors: ", tmp$nErr, ")\n\n", sep=""))
     + }
     + } else {
     + warning("cannot run unit tests -- package RUnit is not available")
     + }
    
     Running unit tests
     $pkg
     [1] "xts"
    
     $getwd
     [1] "/home/hornik/tmp/R.check/r-devel-gcc/Work/PKGS/xts.Rcheck/tests"
    
     $pathToUnitTests
     [1] "/home/hornik/tmp/scratch/Rtmp2hC6pN/RLIBS_307d2814d687/xts/unitTests"
    
     Loading required package: zoo
    
     Attaching package: 'zoo'
    
     The following objects are masked from 'package:base':
    
     as.Date, as.Date.numeric
    
    
    
     Executing test function test.get_tclass_POSIXct_ts2 ... done successfully.
    
    
    
     Executing test function test.get_tclass_ts1 ... done successfully.
    
    
    
     Executing test function test.get_tzone_ts2 ... done successfully.
    
    
    
     Executing test function test.ops_xts1d_matrix1d_dimnames ... done successfully.
    
    
    
     Executing test function test.ops_xts1d_matrix1d_no_dimnames ... done successfully.
    
    
    
     Executing test function test.ops_xts1d_matrix1d_only_colnames ... done successfully.
    
    
    
     Executing test function test.ops_xts1d_matrix1d_only_rownames ... done successfully.
    
    
    
     Executing test function test.ops_xts1d_vector_names ... done successfully.
    
    
    
     Executing test function test.ops_xts1d_vector_no_names ... done successfully.
    
    
    
     Executing test function test.ops_xts1d_xts1d ... done successfully.
    
    
    
     Executing test function test.ops_xts1d_xts1d_different_index ... done successfully.
    
    
    
     Executing test function test.ops_xts2d_matrix2d_dimnames ... done successfully.
    
    
    
     Executing test function test.ops_xts2d_matrix2d_no_dimnames ... done successfully.
    
    
    
     Executing test function test.ops_xts2d_matrix2d_only_colnames ... done successfully.
    
    
    
     Executing test function test.ops_xts2d_matrix2d_only_rownames ... done successfully.
    
    
    
     Executing test function test.ops_xts2d_vector_names ... done successfully.
    
    
    
     Executing test function test.ops_xts2d_vector_no_names ... done successfully.
    
    
    
     Executing test function test.ops_xts_no_dim_matrix1d ... done successfully.
    
    
    
     Executing test function test.ops_xts_no_dim_matrix2d ... done successfully.
    
    
    
     Executing test function test.ops_xts_no_dim_vector ... done successfully.
    
    
    
     Executing test function test.tclass_POSIXct_after_rel_op ... done successfully.
    
    
    
     Executing test function test.tclass_after_rel_op ... done successfully.
    
    
    
     Executing test function test.tzone_after_rel_op ... done successfully.
    
    
    
     Executing test function test.make.index.unique_1us_default_eps ... done successfully.
    
    
    
     Executing test function test.make.index.unique_adds_eps_to_duplicates ... done successfully.
    
    
    
     Executing test function test.make.index.unique_converts_date_index_to_POSIXct ... done successfully.
    
    
    
     Executing test function test.make.index.unique_no_warn_if_unique_timestamps_unchanged ... done successfully.
    
    
    
     Executing test function test.make.index.unique_returns_sorted_index ... done successfully.
    
    
    
     Executing test function test.make.index.unique_warns_ONCE_if_unique_timestamp_changes ... done successfully.
    
    
    
     Executing test function test.make.index.unique_warns_if_unique_timestamp_changes ... Error in make.index.unique.xts(x, eps = eps) :
     (converted from warning) index value is unique but will be replaced; it is less than the cumulative epsilon for the preceding duplicate index values
     In addition: Warning messages:
     1: In RNGkind(kind = testSuite$rngKind, normal.kind = testSuite$rngNormalKind) :
     RNGkind: Marsaglia-Multicarry has poor statistical properties
     2: In RNGkind(kind = testSuite$rngKind, normal.kind = testSuite$rngNormalKind) :
     RNGkind: severe deviations from normality for Kinderman-Ramage + Marsaglia-Multicarry
     3: In RNGkind(kind = testSuite$rngKind, normal.kind = testSuite$rngNormalKind) :
     RNGkind: Marsaglia-Multicarry has poor statistical properties
     4: In RNGkind(kind = testSuite$rngKind, normal.kind = testSuite$rngNormalKind) :
     RNGkind: severe deviations from normality for Kinderman-Ramage + Marsaglia-Multicarry
     5: In make.index.unique.xts(x, eps = 1e-06) :
     index value is unique but will be replaced; it is less than the cumulative epsilon for the preceding duplicate index values
     6: In make.index.unique.xts(x, eps = eps) :
     index value is unique but will be replaced; it is less than the cumulative epsilon for the preceding duplicate index values
     done successfully.
    
    
    
     Executing test function test.attr_on_object_equal_to_attr_on_index ... done successfully.
    
    
    
     Executing test function test.double_with_small_delta_stops ... done successfully.
    
    
    
     Executing test function test.find_first_zero_even_length ... done successfully.
    
    
    
     Executing test function test.find_first_zero_odd_length ... done successfully.
    
    
    
     Executing test function test.find_last_zero_even_length ... done successfully.
    
    
    
     Executing test function test.find_last_zero_odd_length ... done successfully.
    
    
    
     Executing test function test.integer_predicate_no_yes_stops ... done successfully.
    
    
    
     Executing test function test.key_greater_than_max ... done successfully.
    
    
    
     Executing test function test.key_is_NA ... done successfully.
    
    
    
     Executing test function test.key_is_zero_length ... done successfully.
    
    
    
     Executing test function test.key_less_than_min ... done successfully.
    
    
    
     Executing test function test.vec_is_zero_length ... done successfully.
    
    
    
     Executing test function test.coredata_data.frame ... done successfully.
    
    
    
     Executing test function test.coredata_empty ... done successfully.
    
    
    
     Executing test function test.coredata_empty_dim ... done successfully.
    
    
    
     Executing test function test.coredata_empty_dim_dimnames ... done successfully.
    
    
    
     Executing test function test.coredata_matrix ... done successfully.
    
    
    
     Executing test function test.coredata_named_matrix ... done successfully.
    
    
    
     Executing test function test.coredata_named_vector ... done successfully.
    
    
    
     Executing test function test.coredata_ts ... done successfully.
    
    
    
     Executing test function test.coredata_vector ... done successfully.
    
    
    
     Executing test function test.convert_data.frame_to_xts ... done successfully.
    
    
    
     Executing test function test.convert_data.frame_to_xts_i1 ... done successfully.
    
    
    
     Executing test function test.convert_data.frame_to_xts_i1j1 ... done successfully.
    
    
    
     Executing test function test.convert_data.frame_to_xts_j1 ... done successfully.
    
    
    
     Executing test function test.convert_data.frame_to_xts_order.by_Date ... done successfully.
    
    
    
     Executing test function test.convert_data.frame_to_xts_order.by_POSIXct ... done successfully.
    
    
    
     Executing test function test.convert_data.frame_to_xts_order.by_POSIXlt ... done successfully.
    
    
    
     Executing test function test.data.frame_reclass ... done successfully.
    
    
    
     Executing test function test.data.frame_reclass_subset_as.xts_j1 ... done successfully.
    
    
    
     Executing test function test.data.frame_reclass_subset_data.frame_j1 ... Error in try.xts(sample.data.frame[, 1]) :
     Error in as.xts.double(x, ..., .RECLASS = TRUE) : order.by must be either 'names()' or otherwise specified
     In addition: Warning messages:
     1: In RNGkind(kind = testSuite$rngKind, normal.kind = testSuite$rngNormalKind) :
     RNGkind: Marsaglia-Multicarry has poor statistical properties
     2: In RNGkind(kind = testSuite$rngKind, normal.kind = testSuite$rngNormalKind) :
     RNGkind: severe deviations from normality for Kinderman-Ramage + Marsaglia-Multicarry
     3: In RNGkind(kind = testSuite$rngKind, normal.kind = testSuite$rngNormalKind) :
     RNGkind: Marsaglia-Multicarry has poor statistical properties
     4: In RNGkind(kind = testSuite$rngKind, normal.kind = testSuite$rngNormalKind) :
     RNGkind: severe deviations from normality for Kinderman-Ramage + Marsaglia-Multicarry
     5: In RNGkind(kind = testSuite$rngKind, normal.kind = testSuite$rngNormalKind) :
     RNGkind: Marsaglia-Multicarry has poor statistical properties
     6: In RNGkind(kind = testSuite$rngKind, normal.kind = testSuite$rngNormalKind) :
     RNGkind: severe deviations from normality for Kinderman-Ramage + Marsaglia-Multicarry
     7: In RNGkind(kind = testSuite$rngKind, normal.kind = testSuite$rngNormalKind) :
     RNGkind: Marsaglia-Multicarry has poor statistical properties
     8: In RNGkind(kind = testSuite$rngKind, normal.kind = testSuite$rngNormalKind) :
     RNGkind: severe deviations from normality for Kinderman-Ramage + Marsaglia-Multicarry
     done successfully.
    
    
    
     Executing test function test.data.frame_reclass_subset_reclass_j1 ... done successfully.
    
    
    
     Executing test function test.diff_differences_LT1 ... Error in diff.xts(x, 1L, -1L) :
     'diff.xts' defined only for positive lag and differences arguments
     In addition: Warning messages:
     1: In RNGkind(kind = testSuite$rngKind, normal.kind = testSuite$rngNormalKind) :
     RNGkind: Marsaglia-Multicarry has poor statistical properties
     2: In RNGkind(kind = testSuite$rngKind, normal.kind = testSuite$rngNormalKind) :
     RNGkind: severe deviations from normality for Kinderman-Ramage + Marsaglia-Multicarry
     done successfully.
    
    
    
     Executing test function test.diff_differences_NA ... Error in diff.xts(x, 1L, "a") : 'differences' must be integer
     In addition: Warning message:
     In diff.xts(x, 1L, "a") : NAs introduced by coercion
     done successfully.
    
    
    
     Executing test function test.diff_integer_Date ... done successfully.
    
    
    
     Executing test function test.diff_integer_POSIXt ... done successfully.
    
    
    
     Executing test function test.diff_lag_LT1 ... Error in diff.xts(x, -1L, 1L) :
     'diff.xts' defined only for positive lag and differences arguments
     done successfully.
    
    
    
     Executing test function test.diff_lag_NA ... Error in diff.xts(x, "a", 1L) : 'lag' must be integer
     In addition: Warning message:
     In diff.xts(x, "a", 1L) : NAs introduced by coercion
     done successfully.
    
    
    
     Executing test function test.diff_logical_Date ... done successfully.
    
    
    
     Executing test function test.diff_logical_POSIXt ... done successfully.
    
    
    
     Executing test function test.diff_logical_preserves_colnames ... done successfully.
    
    
    
     Executing test function test.diff_numeric_Date ... done successfully.
    
    
    
     Executing test function test.diff_numeric_POSIXt ... done successfully.
    
    
    
     Executing test function test.days_double_index ... done successfully.
    
    
    
     Executing test function test.days_integer_index ... done successfully.
    
    
    
     Executing test function test.double_index_cross_epoch ... done successfully.
    
    
    
     Executing test function test.hours_double_index ... done successfully.
    
    
    
     Executing test function test.hours_integer_index ... done successfully.
    
    
    
     Executing test function test.integer_index_cross_epoch ... done successfully.
    
    
    
     Executing test function test.minutes_double_index ... done successfully.
    
    
    
     Executing test function test.minutes_integer_index ... done successfully.
    
    
    
     Executing test function test.minutes_mins ... done successfully.
    
    
    
     Executing test function test.months_double_index ... done successfully.
    
    
    
     Executing test function test.months_integer_index ... done successfully.
    
    
    
     Executing test function test.multiple_quarters ... done successfully.
    
    
    
     Executing test function test.quarters_double_index ... done successfully.
    
    
    
     Executing test function test.quarters_integer_index ... done successfully.
    
    
    
     Executing test function test.seconds_double_index ... done successfully.
    
    
    
     Executing test function test.seconds_integer_index ... done successfully.
    
    
    
     Executing test function test.seconds_secs ... done successfully.
    
    
    
     Executing test function test.sparse_days ... done successfully.
    
    
    
     Executing test function test.sparse_months ... done successfully.
    
    
    
     Executing test function test.sparse_quarters ... done successfully.
    
    
    
     Executing test function test.sparse_weeks ... done successfully.
    
    
    
     Executing test function test.sparse_years ... done successfully.
    
    
    
     Executing test function test.sub_second_resolution ... done successfully.
    
    
    
     Executing test function test.sub_second_resolution_exact ... done successfully.
    
    
    
     Executing test function test.sub_second_resolution_representation ... done successfully.
    
    
    
     Executing test function test.weeks_double_index ... done successfully.
    
    
    
     Executing test function test.weeks_integer_index ... done successfully.
    
    
    
     Executing test function test.years_double_index ... done successfully.
    
    
    
     Executing test function test.years_integer_index ... done successfully.
    
    
    
     Executing test function test.first_nonxtsible_data.frame_neg_n ... done successfully.
    
    
    
     Executing test function test.first_nonxtsible_data.frame_pos_n ... done successfully.
    
    
    
     Executing test function test.first_nonxtsible_matrix_neg_n ... done successfully.
    
    
    
     Executing test function test.first_nonxtsible_matrix_pos_n ... done successfully.
    
    
    
     Executing test function test.first_nonxtsible_vector ... done successfully.
    
    
    
     Executing test function test.first_xtsible_data.frame_neg_n ... done successfully.
    
    
    
     Executing test function test.first_xtsible_data.frame_pos_n ... done successfully.
    
    
    
     Executing test function test.first_xtsible_matrix_neg_n ... done successfully.
    
    
    
     Executing test function test.first_xtsible_matrix_pos_n ... done successfully.
    
    
    
     Executing test function test.first_xtsible_vector ... done successfully.
    
    
    
     Executing test function test.first_zoo_neg_n ... done successfully.
    
    
    
     Executing test function test.first_zoo_pos_n ... done successfully.
    
    
    
     Executing test function test.last_nonxtsible_data.frame_neg_n ... done successfully.
    
    
    
     Executing test function test.last_nonxtsible_data.frame_pos_n ... done successfully.
    
    
    
     Executing test function test.last_nonxtsible_matrix_neg_n ... done successfully.
    
    
    
     Executing test function test.last_nonxtsible_matrix_pos_n ... done successfully.
    
    
    
     Executing test function test.last_nonxtsible_vector ... done successfully.
    
    
    
     Executing test function test.last_xtsible_data.frame_neg_n ... done successfully.
    
    
    
     Executing test function test.last_xtsible_data.frame_pos_n ... done successfully.
    
    
    
     Executing test function test.last_xtsible_matrix_neg_n ... done successfully.
    
    
    
     Executing test function test.last_xtsible_matrix_pos_n ... done successfully.
    
    
    
     Executing test function test.last_xtsible_vector ... done successfully.
    
    
    
     Executing test function test.last_zoo_neg_n ... done successfully.
    
    
    
     Executing test function test.last_zoo_pos_n ... done successfully.
    
    
    
     Executing test function test.zero_length_vector ... done successfully.
    
    
    
     Executing test function test.zero_row_matrix ... done successfully.
    
    
    
     Executing test function test.convert_fts12_to_xts ... done successfully.
    
    
    
     Executing test function test.convert_fts12_to_xts_i1 ... done successfully.
    
    
    
     Executing test function test.convert_fts12_to_xts_i1j1 ... done successfully.
    
    
    
     Executing test function test.convert_fts12_to_xts_j1 ... done successfully.
    
    
    
     Executing test function test.convert_fts4_to_xts ... done successfully.
    
    
    
     Executing test function test.convert_fts4_to_xts_i1 ... done successfully.
    
    
    
     Executing test function test.convert_fts4_to_xts_i1j1 ... done successfully.
    
    
    
     Executing test function test.convert_fts4_to_xts_j1 ... done successfully.
    
    
    
     Executing test function test.convert_fts_to_xts ... done successfully.
    
    
    
     Executing test function test.convert_fts_to_xts_i1 ... done successfully.
    
    
    
     Executing test function test.convert_fts_to_xts_i1j1 ... done successfully.
    
    
    
     Executing test function test.convert_fts_to_xts_j1 ... done successfully.
    
    
    
     Executing test function test.fts12_reclass ... done successfully.
    
    
    
     Executing test function test.fts12_reclass_subset_as.xfts_j1 ... done successfully.
    
    
    
     Executing test function test.fts12_reclass_subset_fts_j1 ... done successfully.
    
    
    
     Executing test function test.fts12_reclass_subset_reclass_j1 ... done successfully.
    
    
    
     Executing test function test.fts4_reclass ... done successfully.
    
    
    
     Executing test function test.fts4_reclass_subset_as.xts_j1 ... done successfully.
    
    
    
     Executing test function test.fts4_reclass_subset_fts_j1 ... done successfully.
    
    
    
     Executing test function test.fts4_reclass_subset_reclass_j1 ... done successfully.
    
    
    
     Executing test function test.fts_reclass ... done successfully.
    
    
    
     Executing test function test.fts_reclass_subset_as.xts_j1 ... done successfully.
    
    
    
     Executing test function test.fts_reclass_subset_fts_j1 ... done successfully.
    
    
    
     Executing test function test.fts_reclass_subset_reclass_j1 ... done successfully.
    
    
    
     Executing test function test.get_index_does_not_error_if_index_has_no_attributes ... done successfully.
    
    
    
     Executing test function test.set_.index_copies_index_attributes ... done successfully.
    
    
    
     Executing test function test.set_index_copies_index_attributes ... done successfully.
    
    
    
     Executing test function test.set_index_restores_tzone_attribute ... done successfully.
    
    
    
     Executing test function test.checkUTC_set_index2Date ... done successfully.
    
    
    
     Executing test function test.checkUTC_set_index2chron ... done successfully.
    
    
    
     Executing test function test.checkUTC_set_index2yearmon ... done successfully.
    
    
    
     Executing test function test.checkUTC_set_index2yearqtr ... done successfully.
    
    
    
     Executing test function test.convert_Date2Date ... done successfully.
    
    
    
     Executing test function test.convert_Date2POSIXct ... done successfully.
    
    
    
     Executing test function test.convert_Date2chron ... done successfully.
    
    
    
     Executing test function test.convert_Date2timeDate ... done successfully.
    
    
    
     Executing test function test.convert_Date2yearmon ... done successfully.
    
    
    
     Executing test function test.convert_Date2yearqtr ... done successfully.
    
    
    
     Executing test function test.convert_POSIXct2Date ... done successfully.
    
    
    
     Executing test function test.convert_POSIXct2POSIXct ... done successfully.
    
    
    
     Executing test function test.convert_POSIXct2chron ... done successfully.
    
    
    
     Executing test function test.convert_POSIXct2timeDate ... done successfully.
    
    
    
     Executing test function test.convert_POSIXct2yearmon ... done successfully.
    
    
    
     Executing test function test.convert_POSIXct2yearqtr ... done successfully.
    
    
    
     Executing test function test.convert_chron2Date ... done successfully.
    
    
    
     Executing test function test.convert_chron2POSIXct ... done successfully.
    
    
    
     Executing test function test.convert_chron2chron ... done successfully.
    
    
    
     Executing test function test.convert_chron2timeDate ... done successfully.
    
    
    
     Executing test function test.convert_chron2yearmon ... done successfully.
    
    
    
     Executing test function test.convert_chron2yearqtr ... done successfully.
    
    
    
     Executing test function test.convert_timeDate2Date ... done successfully.
    
    
    
     Executing test function test.convert_timeDate2POSIXct ... done successfully.
    
    
    
     Executing test function test.convert_timeDate2chron ... done successfully.
    
    
    
     Executing test function test.convert_timeDate2timeDate ... done successfully.
    
    
    
     Executing test function test.convert_timeDate2yearmon ... done successfully.
    
    
    
     Executing test function test.convert_timeDate2yearqtr ... done successfully.
    
    
    
     Executing test function test.convert_yearmon2Date ... done successfully.
    
    
    
     Executing test function test.convert_yearmon2POSIXct ... done successfully.
    
    
    
     Executing test function test.convert_yearmon2chron ... done successfully.
    
    
    
     Executing test function test.convert_yearmon2timeDate ... done successfully.
    
    
    
     Executing test function test.convert_yearmon2yearmon ... done successfully.
    
    
    
     Executing test function test.convert_yearmon2yearqtr ... done successfully.
    
    
    
     Executing test function test.convert_yearqtr2Date ... done successfully.
    
    
    
     Executing test function test.convert_yearqtr2POSIXct ... done successfully.
    
    
    
     Executing test function test.convert_yearqtr2chron ... done successfully.
    
    
    
     Executing test function test.convert_yearqtr2timeDate ... done successfully.
    
    
    
     Executing test function test.convert_yearqtr2yearmon ... done successfully.
    
    
    
     Executing test function test.convert_yearqtr2yearqtr ... done successfully.
    
    
    
     Executing test function test.indexClass_NULL ... Error in `tclass<-.xts`(x, value) : improperly specified value for tclass
     In addition: There were 50 or more warnings (use warnings() to see the first 50)
     done successfully.
    
    
    
     Executing test function test.indexClass_empty_string ... Error in `tclass<-.xts`(x, value) : unsupported 'tclass' indexing type:
     In addition: Warning message:
     'indexClass<-' is deprecated.
     Use 'tclass<-' instead.
     See help("Deprecated") and help("xts-deprecated").
     done successfully.
    
    
    
     Executing test function test.indexClass_full_index ... Error in `tclass<-.xts`(x, value) : improperly specified value for tclass
     In addition: Warning message:
     'indexClass<-' is deprecated.
     Use 'tclass<-' instead.
     See help("Deprecated") and help("xts-deprecated").
     done successfully.
    
    
    
     Executing test function test.indexClass_missing_object ... Error in eval(expr, envir = parent.frame()) : object 'Date' not found
     In addition: Warning message:
     In rm(Date) : object 'Date' not found
     done successfully.
    
    
    
     Executing test function test.indexClass_unquoted_symbol ... Error in h(simpleError(msg, call)) :
     error in evaluating the argument 'i' in selecting a method for function '[': 'match' requires vector arguments
     In addition: Warning message:
     'indexClass<-' is deprecated.
     Use 'tclass<-' instead.
     See help("Deprecated") and help("xts-deprecated").
     done successfully.
    
    
    
     Executing test function test.convert_irts_to_xts ... done successfully.
    
    
    
     Executing test function test.convert_irts_to_xts_i1 ... done successfully.
    
    
    
     Executing test function test.convert_irts_to_xts_i1j1 ... done successfully.
    
    
    
     Executing test function test.convert_irts_to_xts_j1 ... done successfully.
    
    
    
     Executing test function test.isOrdered_decr ... done successfully.
    
    
    
     Executing test function test.isOrdered_decr_begNA ... done successfully.
    
    
    
     Executing test function test.isOrdered_decr_endNA ... done successfully.
    
    
    
     Executing test function test.isOrdered_decr_midNA ... done successfully.
    
    
    
     Executing test function test.isOrdered_incr ... done successfully.
    
    
    
     Executing test function test.isOrdered_incr_begNA ... done successfully.
    
    
    
     Executing test function test.isOrdered_incr_endNA ... done successfully.
    
    
    
     Executing test function test.isOrdered_incr_midNA ... done successfully.
    
    
    
     Executing test function test.lag_integer_Date ... done successfully.
    
    
    
     Executing test function test.lag_integer_POSIXt ... done successfully.
    
    
    
     Executing test function test.lag_k_NA ... done successfully.
    
    
    
     Executing test function test.lag_k_zero_length ... done successfully.
    
    
    
     Executing test function test.lag_logical_Date ... done successfully.
    
    
    
     Executing test function test.lag_logical_POSIXt ... done successfully.
    
    
    
     Executing test function test.lag_numeric_Date ... done successfully.
    
    
    
     Executing test function test.lag_numeric_POSIXt ... done successfully.
    
    
    
     Executing test function test.convert_matrix_to_xts ... done successfully.
    
    
    
     Executing test function test.convert_matrix_to_xts_i1 ... done successfully.
    
    
    
     Executing test function test.convert_matrix_to_xts_i1j1 ... done successfully.
    
    
    
     Executing test function test.convert_matrix_to_xts_j1 ... done successfully.
    
    
    
     Executing test function test.dimless_xts_to_matrix ... done successfully.
    
    
    
     Executing test function test.matrix_reclass ... done successfully.
    
    
    
     Executing test function test.matrix_reclass_subset_as.xts_j1 ... done successfully.
    
    
    
     Executing test function test.matrix_reclass_subset_matrix_j1 ... done successfully.
    
    
    
     Executing test function test.matrix_reclass_subset_reclass_j1 ... done successfully.
    
    
    
     Executing test function test.zero_width_xts_to_matrix ... done successfully.
    
    
    
     Executing test function test.check_names_false ... done successfully.
    
    
    
     Executing test function test.merge_empty_xts_with_2_scalars ... done successfully.
    
    
    
     Executing test function test.merge_fill_NULL ... done successfully.
    
    
    
     Executing test function test.merge_fill_zero_length ... done successfully.
    
    
    
     Executing test function test.merge_index_contains_Inf ... done successfully.
    
    
    
     Executing test function test.merge_index_contains_NA_double ... done successfully.
    
    
    
     Executing test function test.merge_index_contains_NA_integer ... done successfully.
    
    
    
     Executing test function test.merge_index_contains_NaN ... done successfully.
    
    
    
     Executing test function test.merge_more_than_2_zero_width_objects ... done successfully.
    
    
    
     Executing test function test.merge_with_zero_width_returns_original_type ... done successfully.
    
    
    
     Executing test function test.n_way_merge_on_all_types ... done successfully.
    
    
    
     Executing test function test.shorter_colnames_for_unnamed_args ... done successfully.
    
    
    
     Executing test function test.nalocf ... done successfully.
    
    
    
     Executing test function test.nalocf_by_column ... done successfully.
    
    
    
     Executing test function test.nalocf_by_column_1NA ... done successfully.
    
    
    
     Executing test function test.nalocf_by_column_1NA_fromLast ... done successfully.
    
    
    
     Executing test function test.nalocf_by_column_fromLast ... done successfully.
    
    
    
     Executing test function test.nalocf_by_column_leading_NA ... done successfully.
    
    
    
     Executing test function test.nalocf_by_column_x ... done successfully.
    
    
    
     Executing test function test.nalocf_by_column_xout ... done successfully.
    
    
    
     Executing test function test.nalocf_first_column_all_NA ... done successfully.
    
    
    
     Executing test function test.nalocf_fromLast ... done successfully.
    
    
    
     Executing test function test.nalocf_last_column_all_NA ... done successfully.
    
    
    
     Executing test function test.nalocf_leading_NA ... done successfully.
    
    
    
     Executing test function test.nalocf_x ... done successfully.
    
    
    
     Executing test function test.nalocf_xout ... done successfully.
    
    
    
     Executing test function test.naomit ... done successfully.
    
    
    
     Executing test function test.naomit_by_column ... done successfully.
    
    
    
     Executing test function test.all_dates ... done successfully.
    
    
    
     Executing test function test.end_date_is_garbage ... done successfully.
    
    
    
     Executing test function test.left_open_to_end ... done successfully.
    
    
    
     Executing test function test.single_date ... done successfully.
    
    
    
     Executing test function test.single_date_is_garbage ... done successfully.
    
    
    
     Executing test function test.start_date_is_garbage ... done successfully.
    
    
    
     Executing test function test.start_end_dates_are_garbage ... done successfully.
    
    
    
     Executing test function test.start_end_dates_do_not_exist ... done successfully.
    
    
    
     Executing test function test.start_to_right_open ... done successfully.
    
    
    
     Executing test function test.INDEX_ends_with_lengthX ... done successfully.
    
    
    
     Executing test function test.INDEX_ends_with_lengthX_vector ... done successfully.
    
    
    
     Executing test function test.INDEX_starts_with_zero ... done successfully.
    
    
    
     Executing test function test.INDEX_starts_with_zero_vector ... done successfully.
    
    
    
     Executing test function test.duplicate_INDEX ... done successfully.
    
    
    
     Executing test function test.duplicate_INDEX_vector ... done successfully.
    
    
    
     Executing test function test.intraday_to_daily ... done successfully.
    
    
    
     Executing test function test.period.max_converts_index_to_integer ... done successfully.
    
    
    
     Executing test function test.period.max_equals_apply.monthly ... done successfully.
    
    
    
     Executing test function test.period.min_converts_index_to_integer ... done successfully.
    
    
    
     Executing test function test.period.min_equals_apply.monthly ... done successfully.
    
    
    
     Executing test function test.period.prod_converts_index_to_integer ... done successfully.
    
    
    
     Executing test function test.period.prod_equals_apply.monthly ... done successfully.
    
    
    
     Executing test function test.period.sum_converts_index_to_integer ... done successfully.
    
    
    
     Executing test function test.period.sum_equals_apply.monthly ... done successfully.
    
    
    
     Executing test function test.unsorted_INDEX ... done successfully.
    
    
    
     Executing test function test.unsorted_INDEX_vector ... done successfully.
    
    
    
     Executing test function test.periodicity_on_one_observation_warns ... Error in periodicity(x) :
     (converted from warning) can not calculate periodicity of 1 observation
     In addition: There were 34 warnings (use warnings() to see them)
     done successfully.
    
    
    
     Executing test function test.periodicity_on_zero_observations_warns ... Error in periodicity(x) :
     (converted from warning) can not calculate periodicity of empty object
     In addition: Warning message:
     In periodicity(x) : can not calculate periodicity of empty object
     done successfully.
    
    
    
     Executing test function test.axTicksByTime_ticks.on_quarter ... done successfully.
    
    
    
     Executing test function test.format_xts_yearqtr ... done successfully.
    
    
    
     Executing test function test.format_zoo_yearqtr ... done successfully.
    
    
    
     Executing test function test.reclass_preserves_match.to_tclass ... done successfully.
    
    
    
     Executing test function test.reclass_preserves_match.to_tformat ... done successfully.
    
    
    
     Executing test function test.reclass_preserves_match.to_tzone ... done successfully.
    
    
    
     Executing test function test.split_character_f_not_endpoints ... done successfully.
    
    
    
     Executing test function test.time_of_day_by_hour_start_equals_end ... done successfully.
    
    
    
     Executing test function test.time_of_day_by_minute ... done successfully.
    
    
    
     Executing test function test.time_of_day_by_second ... done successfully.
    
    
    
     Executing test function test.time_of_day_check_time_string ... done successfully.
    
    
    
     Executing test function test.time_of_day_end_before_start ... done successfully.
    
    
    
     Executing test function test.time_of_day_on_zero_width ... done successfully.
    
    
    
     Executing test function test.time_of_day_start_equals_end ... done successfully.
    
    
    
     Executing test function test.time_of_day_when_DST_ends ... done successfully.
    
    
    
     Executing test function test.time_of_day_when_DST_starts ... done successfully.
    
    
    
     Executing test function test.time_of_day_zero_padding ... Error : Supply time-of-day subsetting in the format of T%H:%M:%OS/T%H:%M:%OS
     In addition: Warning messages:
     1: In RNGkind(kind = testSuite$rngKind, normal.kind = testSuite$rngNormalKind) :
     RNGkind: Marsaglia-Multicarry has poor statistical properties
     2: In RNGkind(kind = testSuite$rngKind, normal.kind = testSuite$rngNormalKind) :
     RNGkind: severe deviations from normality for Kinderman-Ramage + Marsaglia-Multicarry
     3: In RNGkind(kind = testSuite$rngKind, normal.kind = testSuite$rngNormalKind) :
     RNGkind: Marsaglia-Multicarry has poor statistical properties
     4: In RNGkind(kind = testSuite$rngKind, normal.kind = testSuite$rngNormalKind) :
     RNGkind: severe deviations from normality for Kinderman-Ramage + Marsaglia-Multicarry
     5: In RNGkind(kind = testSuite$rngKind, normal.kind = testSuite$rngNormalKind) :
     RNGkind: Marsaglia-Multicarry has poor statistical properties
     6: In RNGkind(kind = testSuite$rngKind, normal.kind = testSuite$rngNormalKind) :
     RNGkind: severe deviations from normality for Kinderman-Ramage + Marsaglia-Multicarry
     7: In RNGkind(kind = testSuite$rngKind, normal.kind = testSuite$rngNormalKind) :
     RNGkind: Marsaglia-Multicarry has poor statistical properties
     8: In RNGkind(kind = testSuite$rngKind, normal.kind = testSuite$rngNormalKind) :
     RNGkind: severe deviations from normality for Kinderman-Ramage + Marsaglia-Multicarry
     Error : Supply time-of-day subsetting in the format of T%H:%M:%OS/T%H:%M:%OS
     done successfully.
    
    
    
     Executing test function test.duplicate_index_duplicate_i ... done successfully.
    
    
    
     Executing test function test.empty_i_NA ... done successfully.
    
    
    
     Executing test function test.empty_i_NULL ... done successfully.
    
    
    
     Executing test function test.empty_i_datetime ... done successfully.
    
    
    
     Executing test function test.empty_i_negative ... done successfully.
    
    
    
     Executing test function test.empty_i_zero ... done successfully.
    
    
    
     Executing test function test.i_0 ... done successfully.
    
    
    
     Executing test function test.i_Date ... done successfully.
    
    
    
     Executing test function test.i_POSIXct ... done successfully.
    
    
    
     Executing test function test.i_POSIXlt ... done successfully.
    
    
    
     Executing test function test.i_asis_character ... done successfully.
    
    
    
     Executing test function test.i_character ... done successfully.
    
    
    
     Executing test function test.i_date_range_open_end ... done successfully.
    
    
    
     Executing test function test.i_date_range_open_start ... done successfully.
    
    
    
     Executing test function test.i_integer_j_NA_has_colnames ... done successfully.
    
    
    
     Executing test function test.i_integer_j_NA_no_colnames ... done successfully.
    
    
    
     Executing test function test.i_invalid_date_string ... done successfully.
    
    
    
     Executing test function test.i_missing_j_NA_has_colnames ... done successfully.
    
    
    
     Executing test function test.i_missing_j_NA_no_colnames ... done successfully.
    
    
    
     Executing test function test.i_only_range_separator_or_empty_string ... done successfully.
    
    
    
     Executing test function test.get_coredata_drops_xts_tclass_indexCLASS ... done successfully.
    
    
    
     Executing test function test.get_indexClass_warns ... Error : (converted from warning) 'indexClass' is deprecated.
     Use 'tclass' instead.
     See help("Deprecated") and help("xts-deprecated").
     In addition: Warning messages:
     1: In RNGkind(kind = testSuite$rngKind, normal.kind = testSuite$rngNormalKind) :
     RNGkind: Marsaglia-Multicarry has poor statistical properties
     2: In RNGkind(kind = testSuite$rngKind, normal.kind = testSuite$rngNormalKind) :
     RNGkind: severe deviations from normality for Kinderman-Ramage + Marsaglia-Multicarry
     3: In .parseISO8601(ii, .index(x)[1], .index(x)[nr], tz = tz) :
     cannot determine first and last time from 2012-02-30/2012-02-30
     4: In RNGkind(kind = testSuite$rngKind, normal.kind = testSuite$rngNormalKind) :
     RNGkind: Marsaglia-Multicarry has poor statistical properties
     5: In RNGkind(kind = testSuite$rngKind, normal.kind = testSuite$rngNormalKind) :
     RNGkind: severe deviations from normality for Kinderman-Ramage + Marsaglia-Multicarry
     done successfully.
    
    
    
     Executing test function test.get_tclass ... done successfully.
    
    
    
     Executing test function test.get_xtsAttributes_excludes_tclass_indexCLASS ... done successfully.
    
    
    
     Executing test function test.set_indexClass_warns ... Error : (converted from warning) 'indexClass<-' is deprecated.
     Use 'tclass<-' instead.
     See help("Deprecated") and help("xts-deprecated").
     done successfully.
    
    
    
     Executing test function test.set_tclass_changes_index_tclass ... done successfully.
    
    
    
     Executing test function test.set_tclass_drops_xts_tclass_indexCLASS ... done successfully.
    
    
    
     Executing test function test.set_xtsAttributes_removes_tclass_indexClass ... done successfully.
    
    
    
     Executing test function test.get_coredata_drops_xts_indexFORMAT ... done successfully.
    
    
    
     Executing test function test.get_indexFORMAT_warns ... Error : (converted from warning) 'indexFormat' is deprecated.
     Use 'tformat' instead.
     See help("Deprecated") and help("xts-deprecated").
     In addition: Warning messages:
     1: In RNGkind(kind = testSuite$rngKind, normal.kind = testSuite$rngNormalKind) :
     RNGkind: Marsaglia-Multicarry has poor statistical properties
     2: In RNGkind(kind = testSuite$rngKind, normal.kind = testSuite$rngNormalKind) :
     RNGkind: severe deviations from normality for Kinderman-Ramage + Marsaglia-Multicarry
     done successfully.
    
    
    
     Executing test function test.get_tformat ... done successfully.
    
    
    
     Executing test function test.get_xtsAttributes_excludes_indexFORMAT ... done successfully.
    
    
    
     Executing test function test.set_indexFORMAT_warns ... Error : (converted from warning) 'indexFormat<-' is deprecated.
     Use 'tformat<-' instead.
     See help("Deprecated") and help("xts-deprecated").
     done successfully.
    
    
    
     Executing test function test.set_tformat_changes_index_tformat ... done successfully.
    
    
    
     Executing test function test.set_tformat_drops_xts_indexFORMAT ... done successfully.
    
    
    
     Executing test function test.set_xtsAttributes_removes_indexFORMAT ... done successfully.
    
    
    
     Executing test function test.tbs_199901_to_200801_by_month ... done successfully.
    
    
    
     Executing test function test.tbs_199901_to_200801_by_month_Date ... done successfully.
    
    
    
     Executing test function test.tbs_199901_to_200801_by_month_POSIXct ... done successfully.
    
    
    
     Executing test function test.tbs_199901_to_2008_by_month ... done successfully.
    
    
    
     Executing test function test.tbs_199901_to_2008_by_month_Date ... done successfully.
    
    
    
     Executing test function test.tbs_199901_to_2008_by_month_POSIXct ... done successfully.
    
    
    
     Executing test function test.tbs_1999_to_200801_by_month ... done successfully.
    
    
    
     Executing test function test.tbs_1999_to_200801_by_month_Date ... done successfully.
    
    
    
     Executing test function test.tbs_1999_to_200801_by_month_POSIXct ... done successfully.
    
    
    
     Executing test function test.tbs_1999_to_2008_by_year ... done successfully.
    
    
    
     Executing test function test.tbs_1999_to_2008_by_year_Date ... done successfully.
    
    
    
     Executing test function test.tbs_1999_to_2008_by_year_retclassDate ... done successfully.
    
    
    
     Executing test function test.convert_timeSeries.univariate_to_xts ... done successfully.
    
    
    
     Executing test function test.convert_timeSeries.univariate_to_xts_i1 ... done successfully.
    
    
    
     Executing test function test.convert_timeSeries.univariate_to_xts_i1j1 ... done successfully.
    
    
    
     Executing test function test.convert_timeSeries.univariate_to_xts_j1 ... done successfully.
    
    
    
     Executing test function test.convert_timeSeries_to_xts ... done successfully.
    
    
    
     Executing test function test.convert_timeSeries_to_xts_i1 ... done successfully.
    
    
    
     Executing test function test.convert_timeSeries_to_xts_i1j1 ... done successfully.
    
    
    
     Executing test function test.convert_timeSeries_to_xts_j1 ... done successfully.
    
    
    
     Executing test function test.timeSeries_reclass ... done successfully.
    
    
    
     Executing test function test.timeSeries_reclass_subset_as.xts_j1 ... done successfully.
    
    
    
     Executing test function test.timeSeries_reclass_subset_reclass_j1 ... done successfully.
    
    
    
     Executing test function test.timeSeries_reclass_subset_timeSeries_j1 ... done successfully.
    
    
    
     Executing test function test.to.frequency_includes_first_group ... done successfully.
    
    
    
     Executing test function test.convert_ts12_to_xts ... done successfully.
    
    
    
     Executing test function test.convert_ts12_to_xts_i1 ... done successfully.
    
    
    
     Executing test function test.convert_ts12_to_xts_i1j1 ... done successfully.
    
    
    
     Executing test function test.convert_ts12_to_xts_j1 ... done successfully.
    
    
    
     Executing test function test.convert_ts4_to_xts ... done successfully.
    
    
    
     Executing test function test.convert_ts4_to_xts_i1 ... done successfully.
    
    
    
     Executing test function test.convert_ts4_to_xts_i1j1 ... done successfully.
    
    
    
     Executing test function test.convert_ts4_to_xts_j1 ... done successfully.
    
    
    
     Executing test function test.convert_ts_to_xts ... done successfully.
    
    
    
     Executing test function test.convert_ts_to_xts_i1 ... done successfully.
    
    
    
     Executing test function test.convert_ts_to_xts_i1j1 ... done successfully.
    
    
    
     Executing test function test.convert_ts_to_xts_j1 ... done successfully.
    
    
    
     Executing test function test.ts12_reclass ... done successfully.
    
    
    
     Executing test function test.ts12_reclass_subset_as.xts_j1 ... done successfully.
    
    
    
     Executing test function test.ts12_reclass_subset_reclass_j1 ... done successfully.
    
    
    
     Executing test function test.ts12_reclass_subset_ts_j1 ... done successfully.
    
    
    
     Executing test function test.ts4_reclass ... done successfully.
    
    
    
     Executing test function test.ts4_reclass_subset_as.xts_j1 ... done successfully.
    
    
    
     Executing test function test.ts4_reclass_subset_reclass_j1 ... done successfully.
    
    
    
     Executing test function test.ts4_reclass_subset_ts_j1 ... done successfully.
    
    
    
     Executing test function test.ts_reclass ... done successfully.
    
    
    
     Executing test function test.ts_reclass_subset_as.xts_j1 ... done successfully.
    
    
    
     Executing test function test.ts_reclass_subset_reclass_j1 ... done successfully.
    
    
    
     Executing test function test.ts_reclass_subset_ts_j1 ... done successfully.
    
    
    
     Executing test function test.get_coredata_drops_xts_tzone_indexTZ ... done successfully.
    
    
    
     Executing test function test.get_indexTZ_warns ... Error : (converted from warning) 'indexTZ' is deprecated.
     Use 'tzone' instead.
     See help("Deprecated") and help("xts-deprecated").
     In addition: Warning messages:
     1: In RNGkind(kind = testSuite$rngKind, normal.kind = testSuite$rngNormalKind) :
     RNGkind: Marsaglia-Multicarry has poor statistical properties
     2: In RNGkind(kind = testSuite$rngKind, normal.kind = testSuite$rngNormalKind) :
     RNGkind: severe deviations from normality for Kinderman-Ramage + Marsaglia-Multicarry
     3: In RNGkind(kind = testSuite$rngKind, normal.kind = testSuite$rngNormalKind) :
     RNGkind: Marsaglia-Multicarry has poor statistical properties
     4: In RNGkind(kind = testSuite$rngKind, normal.kind = testSuite$rngNormalKind) :
     RNGkind: severe deviations from normality for Kinderman-Ramage + Marsaglia-Multicarry
     5: In RNGkind(kind = testSuite$rngKind, normal.kind = testSuite$rngNormalKind) :
     RNGkind: Marsaglia-Multicarry has poor statistical properties
     6: In RNGkind(kind = testSuite$rngKind, normal.kind = testSuite$rngNormalKind) :
     RNGkind: severe deviations from normality for Kinderman-Ramage + Marsaglia-Multicarry
     7: In RNGkind(kind = testSuite$rngKind, normal.kind = testSuite$rngNormalKind) :
     RNGkind: Marsaglia-Multicarry has poor statistical properties
     8: In RNGkind(kind = testSuite$rngKind, normal.kind = testSuite$rngNormalKind) :
     RNGkind: severe deviations from normality for Kinderman-Ramage + Marsaglia-Multicarry
     9: In RNGkind(kind = testSuite$rngKind, normal.kind = testSuite$rngNormalKind) :
     RNGkind: Marsaglia-Multicarry has poor statistical properties
     10: In RNGkind(kind = testSuite$rngKind, normal.kind = testSuite$rngNormalKind) :
     RNGkind: severe deviations from normality for Kinderman-Ramage + Marsaglia-Multicarry
     done successfully.
    
    
    
     Executing test function test.get_tzone ... done successfully.
    
    
    
     Executing test function test.get_xtsAttributes_excludes_tzone_indexTZ ... done successfully.
    
    
    
     Executing test function test.set_indexTZ_warns ... Error : (converted from warning) 'indexTZ<-' is deprecated.
     Use 'tzone<-' instead.
     See help("Deprecated") and help("xts-deprecated").
     done successfully.
    
    
    
     Executing test function test.set_tzone_changes_index_tzone ... done successfully.
    
    
    
     Executing test function test.set_tzone_drops_xts_tzone_indexTZ ... done successfully.
    
    
    
     Executing test function test.set_tzone_to_NULL_sets_empty_string ... done successfully.
    
    
    
     Executing test function test.set_xtsAttributes_removes_tzone_indexTZ ... done successfully.
    
    
    
     Executing test function test..xts_ctor_does_not_return_rownames ... done successfully.
    
    
    
     Executing test function test..xts_dimnames_in_dots ... done successfully.
    
    
    
     Executing test function test..xts_index_class_precedence ... done successfully.
    
    
    
     Executing test function test..xts_index_format_precedence ... done successfully.
    
    
    
     Executing test function test..xts_index_tzone_precedence ... done successfully.
    
    
    
     Executing test function test..xts_order.by_Inf_double ... Error in .xts(1:3, c(1, 2, Inf)) :
     'index' cannot contain 'NA', 'NaN', or 'Inf'
     In addition: There were 14 warnings (use warnings() to see them)
     Error in .xts(1:3, c(-Inf, 2, 3)) :
     'index' cannot contain 'NA', 'NaN', or 'Inf'
     done successfully.
    
    
    
     Executing test function test..xts_order.by_NA_double ... Error in .xts(1:3, c(1, 2, NA)) :
     'index' cannot contain 'NA', 'NaN', or 'Inf'
     Error in .xts(1:3, c(NA, 2, 3)) :
     'index' cannot contain 'NA', 'NaN', or 'Inf'
     Error in .xts(1:3, c(1, NA, 3)) :
     'index' cannot contain 'NA', 'NaN', or 'Inf'
     done successfully.
    
    
    
     Executing test function test..xts_order.by_NA_integer ... Error in .xts(1:3, c(1L, 2L, NA)) :
     'index' cannot contain 'NA', 'NaN', or 'Inf'
     Error in .xts(1:3, c(NA, 2L, 3L)) : index is not in increasing order
     Error in .xts(1:3, c(1L, NA, 3L)) : index is not in increasing order
     done successfully.
    
    
    
     Executing test function test..xts_order.by_NaN_double ... Error in .xts(1:3, c(1, 2, NaN)) :
     'index' cannot contain 'NA', 'NaN', or 'Inf'
     Error in .xts(1:3, c(NaN, 2, 3)) :
     'index' cannot contain 'NA', 'NaN', or 'Inf'
     Error in .xts(1:3, c(1, NaN, 3)) :
     'index' cannot contain 'NA', 'NaN', or 'Inf'
     done successfully.
    
    
    
     Executing test function test..xts_user_attributes ... done successfully.
    
    
    
     Executing test function test.ctors_dont_add_indexFORMAT_to_object ... done successfully.
    
    
    
     Executing test function test.ctors_dont_add_tclass_indexCLASS_to_object ... done successfully.
    
    
    
     Executing test function test.ctors_dont_add_tzone_indexTZ_to_object ... done successfully.
    
    
    
     Executing test function test.xts_ctor_warns_for_indexCLASS_arg ... Error in xts(1, as.Date("2018-05-02"), .indexCLASS = "Date") :
     (converted from warning) '.indexCLASS' is deprecated, use tclass instead.
     In addition: Warning messages:
     1: In .xts(1, 1, tformat = "%Y", .indexCLASS = "Date", .indexTZ = "UTC", :
     '.indexCLASS' is deprecated, use tclass instead.
     2: In .xts(1, 1, tformat = "%Y", .indexCLASS = "Date", .indexTZ = "UTC", :
     '.indexTZ' is deprecated and will be ignored, use tzone instead.
     Error in .xts(1, as.Date("2018-05-02"), .indexCLASS = "Date") :
     (converted from warning) '.indexCLASS' is deprecated, use tclass instead.
     done successfully.
    
    
    
     Executing test function test.xts_ctor_warns_for_indexFORMAT_arg ... Error in xts(1, as.Date("2018-05-02"), .indexFORMAT = "%Y") :
     (converted from warning) '.indexFORMAT' is deprecated, use tformat instead.
     Error in .xts(1, as.Date("2018-05-02"), .indexFORMAT = "%Y") :
     (converted from warning) '.indexFORMAT' is deprecated, use tformat instead.
     done successfully.
    
    
    
     Executing test function test.xts_ctor_warns_for_indexTZ_arg ... Error in xts(1, as.Date("2018-05-02"), .indexTZ = "UTC") :
     (converted from warning) '.indexTZ' is deprecated, use tzone instead.
     Error in .xts(1, as.Date("2018-05-02"), .indexTZ = "UTC") :
     (converted from warning) '.indexTZ' is deprecated and will be ignored, use tzone instead.
     done successfully.
    
    
    
     Executing test function test.xts_no_args_has_index_with_tzone_tclass ... done successfully.
    
    
    
     Executing test function test.xts_only_use_first_tzone_element ... done successfully.
    
    
    
     Executing test function test.xts_order.by_Inf_double ... Error in xts(1:3, .POSIXct(c(1, 2, Inf))) :
     'order.by' cannot contain 'NA', 'NaN', or 'Inf'
     Error in xts(1:3, .POSIXct(c(-Inf, 2, 3))) :
     'order.by' cannot contain 'NA', 'NaN', or 'Inf'
     done successfully.
    
    
    
     Executing test function test.xts_order.by_NA_double ... Error in xts(1:3, .POSIXct(c(1, 2, NA))) :
     'order.by' cannot contain 'NA', 'NaN', or 'Inf'
     Error in xts(1:3, .POSIXct(c(NA, 2, 3))) :
     'order.by' cannot contain 'NA', 'NaN', or 'Inf'
     Error in xts(1:3, .POSIXct(c(1, NA, 3))) :
     'order.by' cannot contain 'NA', 'NaN', or 'Inf'
     done successfully.
    
    
    
     Executing test function test.xts_order.by_NA_integer ... Error in xts(1:3, as.Date(c(1L, 2L, NA), origin = "1970-01-01")) :
     'order.by' cannot contain 'NA', 'NaN', or 'Inf'
     Error in xts(1:3, as.Date(c(NA, 2L, 3L), origin = "1970-01-01")) :
     'order.by' cannot contain 'NA', 'NaN', or 'Inf'
     Error in xts(1:3, as.Date(c(1L, NA, 3L), origin = "1970-01-01")) :
     'order.by' cannot contain 'NA', 'NaN', or 'Inf'
     done successfully.
    
    
    
     Executing test function test.xts_order.by_NaN_double ... Error in xts(1:3, .POSIXct(c(1, 2, NaN))) :
     'order.by' cannot contain 'NA', 'NaN', or 'Inf'
     Error in xts(1:3, .POSIXct(c(NaN, 2, 3))) :
     'order.by' cannot contain 'NA', 'NaN', or 'Inf'
     Error in xts(1:3, .POSIXct(c(1, NaN, 3))) :
     'order.by' cannot contain 'NA', 'NaN', or 'Inf'
     done successfully.
    
    
    
     Executing test function test.as.Date.numeric ... done successfully.
    
    
    
     Executing test function test.rbind_zero_length_non_zero_length_Date_errors ... done successfully.
    
    
    
     Executing test function test.rbind_zero_length_non_zero_length_POSIXct_errors ... done successfully.
    
    
    
     Executing test function test.subset_i_ISO8601 ... done successfully.
    
    
    
     Executing test function test.subset_i_datetime_or_character ... done successfully.
    
    
    
     Executing test function test.window ... Timing stopped at: 0.001 0 0.002
     Error in checkIdentical(bin, reg, "Range over gap") : FALSE
     Range over gap
     In addition: Warning messages:
     1: In RNGkind(kind = testSuite$rngKind, normal.kind = testSuite$rngNormalKind) :
     RNGkind: Marsaglia-Multicarry has poor statistical properties
     2: In RNGkind(kind = testSuite$rngKind, normal.kind = testSuite$rngNormalKind) :
     RNGkind: severe deviations from normality for Kinderman-Ramage + Marsaglia-Multicarry
     done successfully.
    
    
    
     Executing test function test.convert_zoo_to_xts ... done successfully.
    
    
    
     Executing test function test.convert_zoo_to_xts_i1 ... done successfully.
    
    
    
     Executing test function test.convert_zoo_to_xts_i1j1 ... done successfully.
    
    
    
     Executing test function test.convert_zoo_to_xts_j1 ... done successfully.
    
    
    
     Executing test function test.zoo_reclass_subset_as.xts_j1 ... done successfully.
    
    
    
     Executing test function test.zoo_reclass_subset_zoo_j1 ... done successfully.
    
     ------------------- UNIT TEST SUMMARY ---------------------
    
     RUNIT TEST PROTOCOL -- Mon Sep 20 03:40:29 2021
     ***********************************************
     Number of test functions: 432
     Number of errors: 0
     Number of failures: 1
    
    
     1 Test Suite :
     xts unit testing - 432 test functions, 0 errors, 1 failure
     FAILURE in test.window: Error in checkIdentical(bin, reg, "Range over gap") : FALSE
     Range over gap
     Error:
    
     unit testing failed (#test failures: 1, #R errors: 0)
    
     In addition: Warning messages:
     1: In RNGkind(kind = testSuite$rngKind, normal.kind = testSuite$rngNormalKind) :
     RNGkind: Marsaglia-Multicarry has poor statistical properties
     2: In RNGkind(kind = testSuite$rngKind, normal.kind = testSuite$rngNormalKind) :
     RNGkind: severe deviations from normality for Kinderman-Ramage + Marsaglia-Multicarry
     Execution halted
Flavor: r-devel-linux-x86_64-debian-gcc

Version: 0.12.1
Check: tests
Result: ERROR
     Running ‘doRUnit.R’ [11s/12s]
    Running the tests in ‘tests/doRUnit.R’ failed.
    Complete output:
     > ## unit tests will not be done if RUnit is not available
     > if(require("RUnit", quietly=TRUE)) {
     +
     + ## --- Setup ---
     + R_CMD_CHECK <- Sys.getenv("RCMDCHECK") != "FALSE"
     +
     + pkg <- "xts" # <-- Change to package name!
     + if (R_CMD_CHECK) {
     + ## Path to unit tests for R CMD check
     + ## PKG.Rcheck/tests/../PKG/unitTests
     + path <- system.file(package=pkg, "unitTests")
     + } else {
     + ## Path to unit tests for standalone running under Makefile (not R CMD check)
     + ## PKG/tests/../inst/unitTests
     + path <- file.path(getwd(), "..", "inst", "unitTests")
     + }
     + cat("\nRunning unit tests\n")
     + print(list(pkg=pkg, getwd=getwd(), pathToUnitTests=path))
     +
     + library(package=pkg, character.only=TRUE)
     +
     + ## If desired, load the name space to allow testing of private functions
     + ## if (is.element(pkg, loadedNamespaces()))
     + ## attach(loadNamespace(pkg), name=paste("namespace", pkg, sep=":"), pos=3)
     + ##
     + ## or simply call PKG:::myPrivateFunction() in tests
     +
     + ## --- Testing ---
     +
     + ## Define tests
     + testSuite <- defineTestSuite(name=paste(pkg, "unit testing"),
     + dirs=path)
     + ## Run
     + tests <- runTestSuite(testSuite)
     +
     + ## Report to stdout
     + cat("------------------- UNIT TEST SUMMARY ---------------------\n\n")
     + printTextProtocol(tests, showDetails=FALSE)
     +
     + ## Report text files (only if not under R CMD check)
     + if (!R_CMD_CHECK) {
     + ## Default report name
     + pathReport <- file.path(path, "report")
     +
     + printTextProtocol(tests, showDetails=FALSE,
     + fileName=paste(pathReport, "Summary.txt", sep=""))
     + printTextProtocol(tests, showDetails=TRUE,
     + fileName=paste(pathReport, ".txt", sep=""))
     +
     + ## Report to HTML file
     + printHTMLProtocol(tests, fileName=paste(pathReport, ".html", sep=""))
     + }
     +
     + ## Return stop() to cause R CMD check stop in case of
     + ## - failures i.e. FALSE to unit tests or
     + ## - errors i.e. R errors
     + tmp <- getErrors(tests)
     + if(tmp$nFail > 0 | tmp$nErr > 0) {
     + stop(paste("\n\nunit testing failed (#test failures: ", tmp$nFail,
     + ", #R errors: ", tmp$nErr, ")\n\n", sep=""))
     + }
     + } else {
     + warning("cannot run unit tests -- package RUnit is not available")
     + }
    
     Running unit tests
     $pkg
     [1] "xts"
    
     $getwd
     [1] "/data/gannet/ripley/R/packages/tests-clang/xts.Rcheck/tests"
    
     $pathToUnitTests
     [1] "/tmp/RtmpPXgzFP/RLIBS_f7f96630c0dda/xts/unitTests"
    
     Loading required package: zoo
    
     Attaching package: 'zoo'
    
     The following objects are masked from 'package:base':
    
     as.Date, as.Date.numeric
    
    
    
     Executing test function test.get_tclass_POSIXct_ts2 ... done successfully.
    
    
    
     Executing test function test.get_tclass_ts1 ... done successfully.
    
    
    
     Executing test function test.get_tzone_ts2 ... done successfully.
    
    
    
     Executing test function test.ops_xts1d_matrix1d_dimnames ... done successfully.
    
    
    
     Executing test function test.ops_xts1d_matrix1d_no_dimnames ... done successfully.
    
    
    
     Executing test function test.ops_xts1d_matrix1d_only_colnames ... done successfully.
    
    
    
     Executing test function test.ops_xts1d_matrix1d_only_rownames ... done successfully.
    
    
    
     Executing test function test.ops_xts1d_vector_names ... done successfully.
    
    
    
     Executing test function test.ops_xts1d_vector_no_names ... done successfully.
    
    
    
     Executing test function test.ops_xts1d_xts1d ... done successfully.
    
    
    
     Executing test function test.ops_xts1d_xts1d_different_index ... done successfully.
    
    
    
     Executing test function test.ops_xts2d_matrix2d_dimnames ... done successfully.
    
    
    
     Executing test function test.ops_xts2d_matrix2d_no_dimnames ... done successfully.
    
    
    
     Executing test function test.ops_xts2d_matrix2d_only_colnames ... done successfully.
    
    
    
     Executing test function test.ops_xts2d_matrix2d_only_rownames ... done successfully.
    
    
    
     Executing test function test.ops_xts2d_vector_names ... done successfully.
    
    
    
     Executing test function test.ops_xts2d_vector_no_names ... done successfully.
    
    
    
     Executing test function test.ops_xts_no_dim_matrix1d ... done successfully.
    
    
    
     Executing test function test.ops_xts_no_dim_matrix2d ... done successfully.
    
    
    
     Executing test function test.ops_xts_no_dim_vector ... done successfully.
    
    
    
     Executing test function test.tclass_POSIXct_after_rel_op ... done successfully.
    
    
    
     Executing test function test.tclass_after_rel_op ... done successfully.
    
    
    
     Executing test function test.tzone_after_rel_op ... done successfully.
    
    
    
     Executing test function test.make.index.unique_1us_default_eps ... done successfully.
    
    
    
     Executing test function test.make.index.unique_adds_eps_to_duplicates ... done successfully.
    
    
    
     Executing test function test.make.index.unique_converts_date_index_to_POSIXct ... done successfully.
    
    
    
     Executing test function test.make.index.unique_no_warn_if_unique_timestamps_unchanged ... done successfully.
    
    
    
     Executing test function test.make.index.unique_returns_sorted_index ... done successfully.
    
    
    
     Executing test function test.make.index.unique_warns_ONCE_if_unique_timestamp_changes ... done successfully.
    
    
    
     Executing test function test.make.index.unique_warns_if_unique_timestamp_changes ... Error in make.index.unique.xts(x, eps = eps) :
     (converted from warning) index value is unique but will be replaced; it is less than the cumulative epsilon for the preceding duplicate index values
     In addition: Warning messages:
     1: In RNGkind(kind = testSuite$rngKind, normal.kind = testSuite$rngNormalKind) :
     RNGkind: Marsaglia-Multicarry has poor statistical properties
     2: In RNGkind(kind = testSuite$rngKind, normal.kind = testSuite$rngNormalKind) :
     RNGkind: severe deviations from normality for Kinderman-Ramage + Marsaglia-Multicarry
     3: In RNGkind(kind = testSuite$rngKind, normal.kind = testSuite$rngNormalKind) :
     RNGkind: Marsaglia-Multicarry has poor statistical properties
     4: In RNGkind(kind = testSuite$rngKind, normal.kind = testSuite$rngNormalKind) :
     RNGkind: severe deviations from normality for Kinderman-Ramage + Marsaglia-Multicarry
     5: In make.index.unique.xts(x, eps = 1e-06) :
     index value is unique but will be replaced; it is less than the cumulative epsilon for the preceding duplicate index values
     6: In make.index.unique.xts(x, eps = eps) :
     index value is unique but will be replaced; it is less than the cumulative epsilon for the preceding duplicate index values
     done successfully.
    
    
    
     Executing test function test.attr_on_object_equal_to_attr_on_index ... done successfully.
    
    
    
     Executing test function test.double_with_small_delta_stops ... done successfully.
    
    
    
     Executing test function test.find_first_zero_even_length ... done successfully.
    
    
    
     Executing test function test.find_first_zero_odd_length ... done successfully.
    
    
    
     Executing test function test.find_last_zero_even_length ... done successfully.
    
    
    
     Executing test function test.find_last_zero_odd_length ... done successfully.
    
    
    
     Executing test function test.integer_predicate_no_yes_stops ... done successfully.
    
    
    
     Executing test function test.key_greater_than_max ... done successfully.
    
    
    
     Executing test function test.key_is_NA ... done successfully.
    
    
    
     Executing test function test.key_is_zero_length ... done successfully.
    
    
    
     Executing test function test.key_less_than_min ... done successfully.
    
    
    
     Executing test function test.vec_is_zero_length ... done successfully.
    
    
    
     Executing test function test.coredata_data.frame ... done successfully.
    
    
    
     Executing test function test.coredata_empty ... done successfully.
    
    
    
     Executing test function test.coredata_empty_dim ... done successfully.
    
    
    
     Executing test function test.coredata_empty_dim_dimnames ... done successfully.
    
    
    
     Executing test function test.coredata_matrix ... done successfully.
    
    
    
     Executing test function test.coredata_named_matrix ... done successfully.
    
    
    
     Executing test function test.coredata_named_vector ... done successfully.
    
    
    
     Executing test function test.coredata_ts ... done successfully.
    
    
    
     Executing test function test.coredata_vector ... done successfully.
    
    
    
     Executing test function test.convert_data.frame_to_xts ... done successfully.
    
    
    
     Executing test function test.convert_data.frame_to_xts_i1 ... done successfully.
    
    
    
     Executing test function test.convert_data.frame_to_xts_i1j1 ... done successfully.
    
    
    
     Executing test function test.convert_data.frame_to_xts_j1 ... done successfully.
    
    
    
     Executing test function test.convert_data.frame_to_xts_order.by_Date ... done successfully.
    
    
    
     Executing test function test.convert_data.frame_to_xts_order.by_POSIXct ... done successfully.
    
    
    
     Executing test function test.convert_data.frame_to_xts_order.by_POSIXlt ... done successfully.
    
    
    
     Executing test function test.data.frame_reclass ... done successfully.
    
    
    
     Executing test function test.data.frame_reclass_subset_as.xts_j1 ... done successfully.
    
    
    
     Executing test function test.data.frame_reclass_subset_data.frame_j1 ... Error in try.xts(sample.data.frame[, 1]) :
     Error in as.xts.double(x, ..., .RECLASS = TRUE) : order.by must be either 'names()' or otherwise specified
     In addition: Warning messages:
     1: In RNGkind(kind = testSuite$rngKind, normal.kind = testSuite$rngNormalKind) :
     RNGkind: Marsaglia-Multicarry has poor statistical properties
     2: In RNGkind(kind = testSuite$rngKind, normal.kind = testSuite$rngNormalKind) :
     RNGkind: severe deviations from normality for Kinderman-Ramage + Marsaglia-Multicarry
     3: In RNGkind(kind = testSuite$rngKind, normal.kind = testSuite$rngNormalKind) :
     RNGkind: Marsaglia-Multicarry has poor statistical properties
     4: In RNGkind(kind = testSuite$rngKind, normal.kind = testSuite$rngNormalKind) :
     RNGkind: severe deviations from normality for Kinderman-Ramage + Marsaglia-Multicarry
     5: In RNGkind(kind = testSuite$rngKind, normal.kind = testSuite$rngNormalKind) :
     RNGkind: Marsaglia-Multicarry has poor statistical properties
     6: In RNGkind(kind = testSuite$rngKind, normal.kind = testSuite$rngNormalKind) :
     RNGkind: severe deviations from normality for Kinderman-Ramage + Marsaglia-Multicarry
     7: In RNGkind(kind = testSuite$rngKind, normal.kind = testSuite$rngNormalKind) :
     RNGkind: Marsaglia-Multicarry has poor statistical properties
     8: In RNGkind(kind = testSuite$rngKind, normal.kind = testSuite$rngNormalKind) :
     RNGkind: severe deviations from normality for Kinderman-Ramage + Marsaglia-Multicarry
     done successfully.
    
    
    
     Executing test function test.data.frame_reclass_subset_reclass_j1 ... done successfully.
    
    
    
     Executing test function test.diff_differences_LT1 ... Error in diff.xts(x, 1L, -1L) :
     'diff.xts' defined only for positive lag and differences arguments
     In addition: Warning messages:
     1: In RNGkind(kind = testSuite$rngKind, normal.kind = testSuite$rngNormalKind) :
     RNGkind: Marsaglia-Multicarry has poor statistical properties
     2: In RNGkind(kind = testSuite$rngKind, normal.kind = testSuite$rngNormalKind) :
     RNGkind: severe deviations from normality for Kinderman-Ramage + Marsaglia-Multicarry
     done successfully.
    
    
    
     Executing test function test.diff_differences_NA ... Error in diff.xts(x, 1L, "a") : 'differences' must be integer
     In addition: Warning message:
     In diff.xts(x, 1L, "a") : NAs introduced by coercion
     done successfully.
    
    
    
     Executing test function test.diff_integer_Date ... done successfully.
    
    
    
     Executing test function test.diff_integer_POSIXt ... done successfully.
    
    
    
     Executing test function test.diff_lag_LT1 ... Error in diff.xts(x, -1L, 1L) :
     'diff.xts' defined only for positive lag and differences arguments
     done successfully.
    
    
    
     Executing test function test.diff_lag_NA ... Error in diff.xts(x, "a", 1L) : 'lag' must be integer
     In addition: Warning message:
     In diff.xts(x, "a", 1L) : NAs introduced by coercion
     done successfully.
    
    
    
     Executing test function test.diff_logical_Date ... done successfully.
    
    
    
     Executing test function test.diff_logical_POSIXt ... done successfully.
    
    
    
     Executing test function test.diff_logical_preserves_colnames ... done successfully.
    
    
    
     Executing test function test.diff_numeric_Date ... done successfully.
    
    
    
     Executing test function test.diff_numeric_POSIXt ... done successfully.
    
    
    
     Executing test function test.days_double_index ... done successfully.
    
    
    
     Executing test function test.days_integer_index ... done successfully.
    
    
    
     Executing test function test.double_index_cross_epoch ... done successfully.
    
    
    
     Executing test function test.hours_double_index ... done successfully.
    
    
    
     Executing test function test.hours_integer_index ... done successfully.
    
    
    
     Executing test function test.integer_index_cross_epoch ... done successfully.
    
    
    
     Executing test function test.minutes_double_index ... done successfully.
    
    
    
     Executing test function test.minutes_integer_index ... done successfully.
    
    
    
     Executing test function test.minutes_mins ... done successfully.
    
    
    
     Executing test function test.months_double_index ... done successfully.
    
    
    
     Executing test function test.months_integer_index ... done successfully.
    
    
    
     Executing test function test.multiple_quarters ... done successfully.
    
    
    
     Executing test function test.quarters_double_index ... done successfully.
    
    
    
     Executing test function test.quarters_integer_index ... done successfully.
    
    
    
     Executing test function test.seconds_double_index ... done successfully.
    
    
    
     Executing test function test.seconds_integer_index ... done successfully.
    
    
    
     Executing test function test.seconds_secs ... done successfully.
    
    
    
     Executing test function test.sparse_days ... done successfully.
    
    
    
     Executing test function test.sparse_months ... done successfully.
    
    
    
     Executing test function test.sparse_quarters ... done successfully.
    
    
    
     Executing test function test.sparse_weeks ... done successfully.
    
    
    
     Executing test function test.sparse_years ... done successfully.
    
    
    
     Executing test function test.sub_second_resolution ... done successfully.
    
    
    
     Executing test function test.sub_second_resolution_exact ... done successfully.
    
    
    
     Executing test function test.sub_second_resolution_representation ... done successfully.
    
    
    
     Executing test function test.weeks_double_index ... done successfully.
    
    
    
     Executing test function test.weeks_integer_index ... done successfully.
    
    
    
     Executing test function test.years_double_index ... done successfully.
    
    
    
     Executing test function test.years_integer_index ... done successfully.
    
    
    
     Executing test function test.first_nonxtsible_data.frame_neg_n ... done successfully.
    
    
    
     Executing test function test.first_nonxtsible_data.frame_pos_n ... done successfully.
    
    
    
     Executing test function test.first_nonxtsible_matrix_neg_n ... done successfully.
    
    
    
     Executing test function test.first_nonxtsible_matrix_pos_n ... done successfully.
    
    
    
     Executing test function test.first_nonxtsible_vector ... done successfully.
    
    
    
     Executing test function test.first_xtsible_data.frame_neg_n ... done successfully.
    
    
    
     Executing test function test.first_xtsible_data.frame_pos_n ... done successfully.
    
    
    
     Executing test function test.first_xtsible_matrix_neg_n ... done successfully.
    
    
    
     Executing test function test.first_xtsible_matrix_pos_n ... done successfully.
    
    
    
     Executing test function test.first_xtsible_vector ... done successfully.
    
    
    
     Executing test function test.first_zoo_neg_n ... done successfully.
    
    
    
     Executing test function test.first_zoo_pos_n ... done successfully.
    
    
    
     Executing test function test.last_nonxtsible_data.frame_neg_n ... done successfully.
    
    
    
     Executing test function test.last_nonxtsible_data.frame_pos_n ... done successfully.
    
    
    
     Executing test function test.last_nonxtsible_matrix_neg_n ... done successfully.
    
    
    
     Executing test function test.last_nonxtsible_matrix_pos_n ... done successfully.
    
    
    
     Executing test function test.last_nonxtsible_vector ... done successfully.
    
    
    
     Executing test function test.last_xtsible_data.frame_neg_n ... done successfully.
    
    
    
     Executing test function test.last_xtsible_data.frame_pos_n ... done successfully.
    
    
    
     Executing test function test.last_xtsible_matrix_neg_n ... done successfully.
    
    
    
     Executing test function test.last_xtsible_matrix_pos_n ... done successfully.
    
    
    
     Executing test function test.last_xtsible_vector ... done successfully.
    
    
    
     Executing test function test.last_zoo_neg_n ... done successfully.
    
    
    
     Executing test function test.last_zoo_pos_n ... done successfully.
    
    
    
     Executing test function test.zero_length_vector ... done successfully.
    
    
    
     Executing test function test.zero_row_matrix ... done successfully.
    
    
    
     Executing test function test.convert_fts12_to_xts ... done successfully.
    
    
    
     Executing test function test.convert_fts12_to_xts_i1 ... done successfully.
    
    
    
     Executing test function test.convert_fts12_to_xts_i1j1 ... done successfully.
    
    
    
     Executing test function test.convert_fts12_to_xts_j1 ... done successfully.
    
    
    
     Executing test function test.convert_fts4_to_xts ... done successfully.
    
    
    
     Executing test function test.convert_fts4_to_xts_i1 ... done successfully.
    
    
    
     Executing test function test.convert_fts4_to_xts_i1j1 ... done successfully.
    
    
    
     Executing test function test.convert_fts4_to_xts_j1 ... done successfully.
    
    
    
     Executing test function test.convert_fts_to_xts ... done successfully.
    
    
    
     Executing test function test.convert_fts_to_xts_i1 ... done successfully.
    
    
    
     Executing test function test.convert_fts_to_xts_i1j1 ... done successfully.
    
    
    
     Executing test function test.convert_fts_to_xts_j1 ... done successfully.
    
    
    
     Executing test function test.fts12_reclass ... done successfully.
    
    
    
     Executing test function test.fts12_reclass_subset_as.xfts_j1 ... done successfully.
    
    
    
     Executing test function test.fts12_reclass_subset_fts_j1 ... done successfully.
    
    
    
     Executing test function test.fts12_reclass_subset_reclass_j1 ... done successfully.
    
    
    
     Executing test function test.fts4_reclass ... done successfully.
    
    
    
     Executing test function test.fts4_reclass_subset_as.xts_j1 ... done successfully.
    
    
    
     Executing test function test.fts4_reclass_subset_fts_j1 ... done successfully.
    
    
    
     Executing test function test.fts4_reclass_subset_reclass_j1 ... done successfully.
    
    
    
     Executing test function test.fts_reclass ... done successfully.
    
    
    
     Executing test function test.fts_reclass_subset_as.xts_j1 ... done successfully.
    
    
    
     Executing test function test.fts_reclass_subset_fts_j1 ... done successfully.
    
    
    
     Executing test function test.fts_reclass_subset_reclass_j1 ... done successfully.
    
    
    
     Executing test function test.get_index_does_not_error_if_index_has_no_attributes ... done successfully.
    
    
    
     Executing test function test.set_.index_copies_index_attributes ... done successfully.
    
    
    
     Executing test function test.set_index_copies_index_attributes ... done successfully.
    
    
    
     Executing test function test.set_index_restores_tzone_attribute ... done successfully.
    
    
    
     Executing test function test.checkUTC_set_index2Date ... done successfully.
    
    
    
     Executing test function test.checkUTC_set_index2chron ... done successfully.
    
    
    
     Executing test function test.checkUTC_set_index2yearmon ... done successfully.
    
    
    
     Executing test function test.checkUTC_set_index2yearqtr ... done successfully.
    
    
    
     Executing test function test.convert_Date2Date ... done successfully.
    
    
    
     Executing test function test.convert_Date2POSIXct ... done successfully.
    
    
    
     Executing test function test.convert_Date2chron ... done successfully.
    
    
    
     Executing test function test.convert_Date2timeDate ... done successfully.
    
    
    
     Executing test function test.convert_Date2yearmon ... done successfully.
    
    
    
     Executing test function test.convert_Date2yearqtr ... done successfully.
    
    
    
     Executing test function test.convert_POSIXct2Date ... done successfully.
    
    
    
     Executing test function test.convert_POSIXct2POSIXct ... done successfully.
    
    
    
     Executing test function test.convert_POSIXct2chron ... done successfully.
    
    
    
     Executing test function test.convert_POSIXct2timeDate ... done successfully.
    
    
    
     Executing test function test.convert_POSIXct2yearmon ... done successfully.
    
    
    
     Executing test function test.convert_POSIXct2yearqtr ... done successfully.
    
    
    
     Executing test function test.convert_chron2Date ... done successfully.
    
    
    
     Executing test function test.convert_chron2POSIXct ... done successfully.
    
    
    
     Executing test function test.convert_chron2chron ... done successfully.
    
    
    
     Executing test function test.convert_chron2timeDate ... done successfully.
    
    
    
     Executing test function test.convert_chron2yearmon ... done successfully.
    
    
    
     Executing test function test.convert_chron2yearqtr ... done successfully.
    
    
    
     Executing test function test.convert_timeDate2Date ... done successfully.
    
    
    
     Executing test function test.convert_timeDate2POSIXct ... done successfully.
    
    
    
     Executing test function test.convert_timeDate2chron ... done successfully.
    
    
    
     Executing test function test.convert_timeDate2timeDate ... done successfully.
    
    
    
     Executing test function test.convert_timeDate2yearmon ... done successfully.
    
    
    
     Executing test function test.convert_timeDate2yearqtr ... done successfully.
    
    
    
     Executing test function test.convert_yearmon2Date ... done successfully.
    
    
    
     Executing test function test.convert_yearmon2POSIXct ... done successfully.
    
    
    
     Executing test function test.convert_yearmon2chron ... done successfully.
    
    
    
     Executing test function test.convert_yearmon2timeDate ... done successfully.
    
    
    
     Executing test function test.convert_yearmon2yearmon ... done successfully.
    
    
    
     Executing test function test.convert_yearmon2yearqtr ... done successfully.
    
    
    
     Executing test function test.convert_yearqtr2Date ... done successfully.
    
    
    
     Executing test function test.convert_yearqtr2POSIXct ... done successfully.
    
    
    
     Executing test function test.convert_yearqtr2chron ... done successfully.
    
    
    
     Executing test function test.convert_yearqtr2timeDate ... done successfully.
    
    
    
     Executing test function test.convert_yearqtr2yearmon ... done successfully.
    
    
    
     Executing test function test.convert_yearqtr2yearqtr ... done successfully.
    
    
    
     Executing test function test.indexClass_NULL ... Error in `tclass<-.xts`(x, value) : improperly specified value for tclass
     In addition: There were 50 or more warnings (use warnings() to see the first 50)
     done successfully.
    
    
    
     Executing test function test.indexClass_empty_string ... Error in `tclass<-.xts`(x, value) : unsupported 'tclass' indexing type:
     In addition: Warning message:
     'indexClass<-' is deprecated.
     Use 'tclass<-' instead.
     See help("Deprecated") and help("xts-deprecated").
     done successfully.
    
    
    
     Executing test function test.indexClass_full_index ... Error in `tclass<-.xts`(x, value) : improperly specified value for tclass
     In addition: Warning message:
     'indexClass<-' is deprecated.
     Use 'tclass<-' instead.
     See help("Deprecated") and help("xts-deprecated").
     done successfully.
    
    
    
     Executing test function test.indexClass_missing_object ... Error in eval(expr, envir = parent.frame()) : object 'Date' not found
     In addition: Warning message:
     In rm(Date) : object 'Date' not found
     done successfully.
    
    
    
     Executing test function test.indexClass_unquoted_symbol ... Error in h(simpleError(msg, call)) :
     error in evaluating the argument 'i' in selecting a method for function '[': 'match' requires vector arguments
     In addition: Warning message:
     'indexClass<-' is deprecated.
     Use 'tclass<-' instead.
     See help("Deprecated") and help("xts-deprecated").
     done successfully.
    
    
    
     Executing test function test.convert_irts_to_xts ... done successfully.
    
    
    
     Executing test function test.convert_irts_to_xts_i1 ... done successfully.
    
    
    
     Executing test function test.convert_irts_to_xts_i1j1 ... done successfully.
    
    
    
     Executing test function test.convert_irts_to_xts_j1 ... done successfully.
    
    
    
     Executing test function test.isOrdered_decr ... done successfully.
    
    
    
     Executing test function test.isOrdered_decr_begNA ... done successfully.
    
    
    
     Executing test function test.isOrdered_decr_endNA ... done successfully.
    
    
    
     Executing test function test.isOrdered_decr_midNA ... done successfully.
    
    
    
     Executing test function test.isOrdered_incr ... done successfully.
    
    
    
     Executing test function test.isOrdered_incr_begNA ... done successfully.
    
    
    
     Executing test function test.isOrdered_incr_endNA ... done successfully.
    
    
    
     Executing test function test.isOrdered_incr_midNA ... done successfully.
    
    
    
     Executing test function test.lag_integer_Date ... done successfully.
    
    
    
     Executing test function test.lag_integer_POSIXt ... done successfully.
    
    
    
     Executing test function test.lag_k_NA ... done successfully.
    
    
    
     Executing test function test.lag_k_zero_length ... done successfully.
    
    
    
     Executing test function test.lag_logical_Date ... done successfully.
    
    
    
     Executing test function test.lag_logical_POSIXt ... done successfully.
    
    
    
     Executing test function test.lag_numeric_Date ... done successfully.
    
    
    
     Executing test function test.lag_numeric_POSIXt ... done successfully.
    
    
    
     Executing test function test.convert_matrix_to_xts ... done successfully.
    
    
    
     Executing test function test.convert_matrix_to_xts_i1 ... done successfully.
    
    
    
     Executing test function test.convert_matrix_to_xts_i1j1 ... done successfully.
    
    
    
     Executing test function test.convert_matrix_to_xts_j1 ... done successfully.
    
    
    
     Executing test function test.dimless_xts_to_matrix ... done successfully.
    
    
    
     Executing test function test.matrix_reclass ... done successfully.
    
    
    
     Executing test function test.matrix_reclass_subset_as.xts_j1 ... done successfully.
    
    
    
     Executing test function test.matrix_reclass_subset_matrix_j1 ... done successfully.
    
    
    
     Executing test function test.matrix_reclass_subset_reclass_j1 ... done successfully.
    
    
    
     Executing test function test.zero_width_xts_to_matrix ... done successfully.
    
    
    
     Executing test function test.check_names_false ... done successfully.
    
    
    
     Executing test function test.merge_empty_xts_with_2_scalars ... done successfully.
    
    
    
     Executing test function test.merge_fill_NULL ... done successfully.
    
    
    
     Executing test function test.merge_fill_zero_length ... done successfully.
    
    
    
     Executing test function test.merge_index_contains_Inf ... done successfully.
    
    
    
     Executing test function test.merge_index_contains_NA_double ... done successfully.
    
    
    
     Executing test function test.merge_index_contains_NA_integer ... done successfully.
    
    
    
     Executing test function test.merge_index_contains_NaN ... done successfully.
    
    
    
     Executing test function test.merge_more_than_2_zero_width_objects ... done successfully.
    
    
    
     Executing test function test.merge_with_zero_width_returns_original_type ... done successfully.
    
    
    
     Executing test function test.n_way_merge_on_all_types ... done successfully.
    
    
    
     Executing test function test.shorter_colnames_for_unnamed_args ... done successfully.
    
    
    
     Executing test function test.nalocf ... done successfully.
    
    
    
     Executing test function test.nalocf_by_column ... done successfully.
    
    
    
     Executing test function test.nalocf_by_column_1NA ... done successfully.
    
    
    
     Executing test function test.nalocf_by_column_1NA_fromLast ... done successfully.
    
    
    
     Executing test function test.nalocf_by_column_fromLast ... done successfully.
    
    
    
     Executing test function test.nalocf_by_column_leading_NA ... done successfully.
    
    
    
     Executing test function test.nalocf_by_column_x ... done successfully.
    
    
    
     Executing test function test.nalocf_by_column_xout ... done successfully.
    
    
    
     Executing test function test.nalocf_first_column_all_NA ... done successfully.
    
    
    
     Executing test function test.nalocf_fromLast ... done successfully.
    
    
    
     Executing test function test.nalocf_last_column_all_NA ... done successfully.
    
    
    
     Executing test function test.nalocf_leading_NA ... done successfully.
    
    
    
     Executing test function test.nalocf_x ... done successfully.
    
    
    
     Executing test function test.nalocf_xout ... done successfully.
    
    
    
     Executing test function test.naomit ... done successfully.
    
    
    
     Executing test function test.naomit_by_column ... done successfully.
    
    
    
     Executing test function test.all_dates ... done successfully.
    
    
    
     Executing test function test.end_date_is_garbage ... done successfully.
    
    
    
     Executing test function test.left_open_to_end ... done successfully.
    
    
    
     Executing test function test.single_date ... done successfully.
    
    
    
     Executing test function test.single_date_is_garbage ... done successfully.
    
    
    
     Executing test function test.start_date_is_garbage ... done successfully.
    
    
    
     Executing test function test.start_end_dates_are_garbage ... done successfully.
    
    
    
     Executing test function test.start_end_dates_do_not_exist ... done successfully.
    
    
    
     Executing test function test.start_to_right_open ... done successfully.
    
    
    
     Executing test function test.INDEX_ends_with_lengthX ... done successfully.
    
    
    
     Executing test function test.INDEX_ends_with_lengthX_vector ... done successfully.
    
    
    
     Executing test function test.INDEX_starts_with_zero ... done successfully.
    
    
    
     Executing test function test.INDEX_starts_with_zero_vector ... done successfully.
    
    
    
     Executing test function test.duplicate_INDEX ... done successfully.
    
    
    
     Executing test function test.duplicate_INDEX_vector ... done successfully.
    
    
    
     Executing test function test.intraday_to_daily ... done successfully.
    
    
    
     Executing test function test.period.max_converts_index_to_integer ... done successfully.
    
    
    
     Executing test function test.period.max_equals_apply.monthly ... done successfully.
    
    
    
     Executing test function test.period.min_converts_index_to_integer ... done successfully.
    
    
    
     Executing test function test.period.min_equals_apply.monthly ... done successfully.
    
    
    
     Executing test function test.period.prod_converts_index_to_integer ... done successfully.
    
    
    
     Executing test function test.period.prod_equals_apply.monthly ... done successfully.
    
    
    
     Executing test function test.period.sum_converts_index_to_integer ... done successfully.
    
    
    
     Executing test function test.period.sum_equals_apply.monthly ... done successfully.
    
    
    
     Executing test function test.unsorted_INDEX ... done successfully.
    
    
    
     Executing test function test.unsorted_INDEX_vector ... done successfully.
    
    
    
     Executing test function test.periodicity_on_one_observation_warns ... Error in periodicity(x) :
     (converted from warning) can not calculate periodicity of 1 observation
     In addition: There were 34 warnings (use warnings() to see them)
     done successfully.
    
    
    
     Executing test function test.periodicity_on_zero_observations_warns ... Error in periodicity(x) :
     (converted from warning) can not calculate periodicity of empty object
     In addition: Warning message:
     In periodicity(x) : can not calculate periodicity of empty object
     done successfully.
    
    
    
     Executing test function test.axTicksByTime_ticks.on_quarter ... done successfully.
    
    
    
     Executing test function test.format_xts_yearqtr ... done successfully.
    
    
    
     Executing test function test.format_zoo_yearqtr ... done successfully.
    
    
    
     Executing test function test.reclass_preserves_match.to_tclass ... done successfully.
    
    
    
     Executing test function test.reclass_preserves_match.to_tformat ... done successfully.
    
    
    
     Executing test function test.reclass_preserves_match.to_tzone ... done successfully.
    
    
    
     Executing test function test.split_character_f_not_endpoints ... done successfully.
    
    
    
     Executing test function test.time_of_day_by_hour_start_equals_end ... done successfully.
    
    
    
     Executing test function test.time_of_day_by_minute ... done successfully.
    
    
    
     Executing test function test.time_of_day_by_second ... done successfully.
    
    
    
     Executing test function test.time_of_day_check_time_string ... done successfully.
    
    
    
     Executing test function test.time_of_day_end_before_start ... done successfully.
    
    
    
     Executing test function test.time_of_day_on_zero_width ... done successfully.
    
    
    
     Executing test function test.time_of_day_start_equals_end ... done successfully.
    
    
    
     Executing test function test.time_of_day_when_DST_ends ... done successfully.
    
    
    
     Executing test function test.time_of_day_when_DST_starts ... done successfully.
    
    
    
     Executing test function test.time_of_day_zero_padding ... Error : Supply time-of-day subsetting in the format of T%H:%M:%OS/T%H:%M:%OS
     In addition: Warning messages:
     1: In RNGkind(kind = testSuite$rngKind, normal.kind = testSuite$rngNormalKind) :
     RNGkind: Marsaglia-Multicarry has poor statistical properties
     2: In RNGkind(kind = testSuite$rngKind, normal.kind = testSuite$rngNormalKind) :
     RNGkind: severe deviations from normality for Kinderman-Ramage + Marsaglia-Multicarry
     3: In RNGkind(kind = testSuite$rngKind, normal.kind = testSuite$rngNormalKind) :
     RNGkind: Marsaglia-Multicarry has poor statistical properties
     4: In RNGkind(kind = testSuite$rngKind, normal.kind = testSuite$rngNormalKind) :
     RNGkind: severe deviations from normality for Kinderman-Ramage + Marsaglia-Multicarry
     5: In RNGkind(kind = testSuite$rngKind, normal.kind = testSuite$rngNormalKind) :
     RNGkind: Marsaglia-Multicarry has poor statistical properties
     6: In RNGkind(kind = testSuite$rngKind, normal.kind = testSuite$rngNormalKind) :
     RNGkind: severe deviations from normality for Kinderman-Ramage + Marsaglia-Multicarry
     7: In RNGkind(kind = testSuite$rngKind, normal.kind = testSuite$rngNormalKind) :
     RNGkind: Marsaglia-Multicarry has poor statistical properties
     8: In RNGkind(kind = testSuite$rngKind, normal.kind = testSuite$rngNormalKind) :
     RNGkind: severe deviations from normality for Kinderman-Ramage + Marsaglia-Multicarry
     Error : Supply time-of-day subsetting in the format of T%H:%M:%OS/T%H:%M:%OS
     done successfully.
    
    
    
     Executing test function test.duplicate_index_duplicate_i ... done successfully.
    
    
    
     Executing test function test.empty_i_NA ... done successfully.
    
    
    
     Executing test function test.empty_i_NULL ... done successfully.
    
    
    
     Executing test function test.empty_i_datetime ... done successfully.
    
    
    
     Executing test function test.empty_i_negative ... done successfully.
    
    
    
     Executing test function test.empty_i_zero ... done successfully.
    
    
    
     Executing test function test.i_0 ... done successfully.
    
    
    
     Executing test function test.i_Date ... done successfully.
    
    
    
     Executing test function test.i_POSIXct ... done successfully.
    
    
    
     Executing test function test.i_POSIXlt ... done successfully.
    
    
    
     Executing test function test.i_asis_character ... done successfully.
    
    
    
     Executing test function test.i_character ... done successfully.
    
    
    
     Executing test function test.i_date_range_open_end ... done successfully.
    
    
    
     Executing test function test.i_date_range_open_start ... done successfully.
    
    
    
     Executing test function test.i_integer_j_NA_has_colnames ... done successfully.
    
    
    
     Executing test function test.i_integer_j_NA_no_colnames ... done successfully.
    
    
    
     Executing test function test.i_invalid_date_string ... done successfully.
    
    
    
     Executing test function test.i_missing_j_NA_has_colnames ... done successfully.
    
    
    
     Executing test function test.i_missing_j_NA_no_colnames ... done successfully.
    
    
    
     Executing test function test.i_only_range_separator_or_empty_string ... done successfully.
    
    
    
     Executing test function test.get_coredata_drops_xts_tclass_indexCLASS ... done successfully.
    
    
    
     Executing test function test.get_indexClass_warns ... Error : (converted from warning) 'indexClass' is deprecated.
     Use 'tclass' instead.
     See help("Deprecated") and help("xts-deprecated").
     In addition: Warning messages:
     1: In RNGkind(kind = testSuite$rngKind, normal.kind = testSuite$rngNormalKind) :
     RNGkind: Marsaglia-Multicarry has poor statistical properties
     2: In RNGkind(kind = testSuite$rngKind, normal.kind = testSuite$rngNormalKind) :
     RNGkind: severe deviations from normality for Kinderman-Ramage + Marsaglia-Multicarry
     3: In .parseISO8601(ii, .index(x)[1], .index(x)[nr], tz = tz) :
     cannot determine first and last time from 2012-02-30/2012-02-30
     4: In RNGkind(kind = testSuite$rngKind, normal.kind = testSuite$rngNormalKind) :
     RNGkind: Marsaglia-Multicarry has poor statistical properties
     5: In RNGkind(kind = testSuite$rngKind, normal.kind = testSuite$rngNormalKind) :
     RNGkind: severe deviations from normality for Kinderman-Ramage + Marsaglia-Multicarry
     done successfully.
    
    
    
     Executing test function test.get_tclass ... done successfully.
    
    
    
     Executing test function test.get_xtsAttributes_excludes_tclass_indexCLASS ... done successfully.
    
    
    
     Executing test function test.set_indexClass_warns ... Error : (converted from warning) 'indexClass<-' is deprecated.
     Use 'tclass<-' instead.
     See help("Deprecated") and help("xts-deprecated").
     done successfully.
    
    
    
     Executing test function test.set_tclass_changes_index_tclass ... done successfully.
    
    
    
     Executing test function test.set_tclass_drops_xts_tclass_indexCLASS ... done successfully.
    
    
    
     Executing test function test.set_xtsAttributes_removes_tclass_indexClass ... done successfully.
    
    
    
     Executing test function test.get_coredata_drops_xts_indexFORMAT ... done successfully.
    
    
    
     Executing test function test.get_indexFORMAT_warns ... Error : (converted from warning) 'indexFormat' is deprecated.
     Use 'tformat' instead.
     See help("Deprecated") and help("xts-deprecated").
     In addition: Warning messages:
     1: In RNGkind(kind = testSuite$rngKind, normal.kind = testSuite$rngNormalKind) :
     RNGkind: Marsaglia-Multicarry has poor statistical properties
     2: In RNGkind(kind = testSuite$rngKind, normal.kind = testSuite$rngNormalKind) :
     RNGkind: severe deviations from normality for Kinderman-Ramage + Marsaglia-Multicarry
     done successfully.
    
    
    
     Executing test function test.get_tformat ... done successfully.
    
    
    
     Executing test function test.get_xtsAttributes_excludes_indexFORMAT ... done successfully.
    
    
    
     Executing test function test.set_indexFORMAT_warns ... Error : (converted from warning) 'indexFormat<-' is deprecated.
     Use 'tformat<-' instead.
     See help("Deprecated") and help("xts-deprecated").
     done successfully.
    
    
    
     Executing test function test.set_tformat_changes_index_tformat ... done successfully.
    
    
    
     Executing test function test.set_tformat_drops_xts_indexFORMAT ... done successfully.
    
    
    
     Executing test function test.set_xtsAttributes_removes_indexFORMAT ... done successfully.
    
    
    
     Executing test function test.tbs_199901_to_200801_by_month ... done successfully.
    
    
    
     Executing test function test.tbs_199901_to_200801_by_month_Date ... done successfully.
    
    
    
     Executing test function test.tbs_199901_to_200801_by_month_POSIXct ... done successfully.
    
    
    
     Executing test function test.tbs_199901_to_2008_by_month ... done successfully.
    
    
    
     Executing test function test.tbs_199901_to_2008_by_month_Date ... done successfully.
    
    
    
     Executing test function test.tbs_199901_to_2008_by_month_POSIXct ... done successfully.
    
    
    
     Executing test function test.tbs_1999_to_200801_by_month ... done successfully.
    
    
    
     Executing test function test.tbs_1999_to_200801_by_month_Date ... done successfully.
    
    
    
     Executing test function test.tbs_1999_to_200801_by_month_POSIXct ... done successfully.
    
    
    
     Executing test function test.tbs_1999_to_2008_by_year ... done successfully.
    
    
    
     Executing test function test.tbs_1999_to_2008_by_year_Date ... done successfully.
    
    
    
     Executing test function test.tbs_1999_to_2008_by_year_retclassDate ... done successfully.
    
    
    
     Executing test function test.convert_timeSeries.univariate_to_xts ... done successfully.
    
    
    
     Executing test function test.convert_timeSeries.univariate_to_xts_i1 ... done successfully.
    
    
    
     Executing test function test.convert_timeSeries.univariate_to_xts_i1j1 ... done successfully.
    
    
    
     Executing test function test.convert_timeSeries.univariate_to_xts_j1 ... done successfully.
    
    
    
     Executing test function test.convert_timeSeries_to_xts ... done successfully.
    
    
    
     Executing test function test.convert_timeSeries_to_xts_i1 ... done successfully.
    
    
    
     Executing test function test.convert_timeSeries_to_xts_i1j1 ... done successfully.
    
    
    
     Executing test function test.convert_timeSeries_to_xts_j1 ... done successfully.
    
    
    
     Executing test function test.timeSeries_reclass ... done successfully.
    
    
    
     Executing test function test.timeSeries_reclass_subset_as.xts_j1 ... done successfully.
    
    
    
     Executing test function test.timeSeries_reclass_subset_reclass_j1 ... done successfully.
    
    
    
     Executing test function test.timeSeries_reclass_subset_timeSeries_j1 ... done successfully.
    
    
    
     Executing test function test.to.frequency_includes_first_group ... done successfully.
    
    
    
     Executing test function test.convert_ts12_to_xts ... done successfully.
    
    
    
     Executing test function test.convert_ts12_to_xts_i1 ... done successfully.
    
    
    
     Executing test function test.convert_ts12_to_xts_i1j1 ... done successfully.
    
    
    
     Executing test function test.convert_ts12_to_xts_j1 ... done successfully.
    
    
    
     Executing test function test.convert_ts4_to_xts ... done successfully.
    
    
    
     Executing test function test.convert_ts4_to_xts_i1 ... done successfully.
    
    
    
     Executing test function test.convert_ts4_to_xts_i1j1 ... done successfully.
    
    
    
     Executing test function test.convert_ts4_to_xts_j1 ... done successfully.
    
    
    
     Executing test function test.convert_ts_to_xts ... done successfully.
    
    
    
     Executing test function test.convert_ts_to_xts_i1 ... done successfully.
    
    
    
     Executing test function test.convert_ts_to_xts_i1j1 ... done successfully.
    
    
    
     Executing test function test.convert_ts_to_xts_j1 ... done successfully.
    
    
    
     Executing test function test.ts12_reclass ... done successfully.
    
    
    
     Executing test function test.ts12_reclass_subset_as.xts_j1 ... done successfully.
    
    
    
     Executing test function test.ts12_reclass_subset_reclass_j1 ... done successfully.
    
    
    
     Executing test function test.ts12_reclass_subset_ts_j1 ... done successfully.
    
    
    
     Executing test function test.ts4_reclass ... done successfully.
    
    
    
     Executing test function test.ts4_reclass_subset_as.xts_j1 ... done successfully.
    
    
    
     Executing test function test.ts4_reclass_subset_reclass_j1 ... done successfully.
    
    
    
     Executing test function test.ts4_reclass_subset_ts_j1 ... done successfully.
    
    
    
     Executing test function test.ts_reclass ... done successfully.
    
    
    
     Executing test function test.ts_reclass_subset_as.xts_j1 ... done successfully.
    
    
    
     Executing test function test.ts_reclass_subset_reclass_j1 ... done successfully.
    
    
    
     Executing test function test.ts_reclass_subset_ts_j1 ... done successfully.
    
    
    
     Executing test function test.get_coredata_drops_xts_tzone_indexTZ ... done successfully.
    
    
    
     Executing test function test.get_indexTZ_warns ... Error : (converted from warning) 'indexTZ' is deprecated.
     Use 'tzone' instead.
     See help("Deprecated") and help("xts-deprecated").
     In addition: Warning messages:
     1: In RNGkind(kind = testSuite$rngKind, normal.kind = testSuite$rngNormalKind) :
     RNGkind: Marsaglia-Multicarry has poor statistical properties
     2: In RNGkind(kind = testSuite$rngKind, normal.kind = testSuite$rngNormalKind) :
     RNGkind: severe deviations from normality for Kinderman-Ramage + Marsaglia-Multicarry
     3: In RNGkind(kind = testSuite$rngKind, normal.kind = testSuite$rngNormalKind) :
     RNGkind: Marsaglia-Multicarry has poor statistical properties
     4: In RNGkind(kind = testSuite$rngKind, normal.kind = testSuite$rngNormalKind) :
     RNGkind: severe deviations from normality for Kinderman-Ramage + Marsaglia-Multicarry
     5: In RNGkind(kind = testSuite$rngKind, normal.kind = testSuite$rngNormalKind) :
     RNGkind: Marsaglia-Multicarry has poor statistical properties
     6: In RNGkind(kind = testSuite$rngKind, normal.kind = testSuite$rngNormalKind) :
     RNGkind: severe deviations from normality for Kinderman-Ramage + Marsaglia-Multicarry
     7: In RNGkind(kind = testSuite$rngKind, normal.kind = testSuite$rngNormalKind) :
     RNGkind: Marsaglia-Multicarry has poor statistical properties
     8: In RNGkind(kind = testSuite$rngKind, normal.kind = testSuite$rngNormalKind) :
     RNGkind: severe deviations from normality for Kinderman-Ramage + Marsaglia-Multicarry
     9: In RNGkind(kind = testSuite$rngKind, normal.kind = testSuite$rngNormalKind) :
     RNGkind: Marsaglia-Multicarry has poor statistical properties
     10: In RNGkind(kind = testSuite$rngKind, normal.kind = testSuite$rngNormalKind) :
     RNGkind: severe deviations from normality for Kinderman-Ramage + Marsaglia-Multicarry
     done successfully.
    
    
    
     Executing test function test.get_tzone ... done successfully.
    
    
    
     Executing test function test.get_xtsAttributes_excludes_tzone_indexTZ ... done successfully.
    
    
    
     Executing test function test.set_indexTZ_warns ... Error : (converted from warning) 'indexTZ<-' is deprecated.
     Use 'tzone<-' instead.
     See help("Deprecated") and help("xts-deprecated").
     done successfully.
    
    
    
     Executing test function test.set_tzone_changes_index_tzone ... done successfully.
    
    
    
     Executing test function test.set_tzone_drops_xts_tzone_indexTZ ... done successfully.
    
    
    
     Executing test function test.set_tzone_to_NULL_sets_empty_string ... done successfully.
    
    
    
     Executing test function test.set_xtsAttributes_removes_tzone_indexTZ ... done successfully.
    
    
    
     Executing test function test..xts_ctor_does_not_return_rownames ... done successfully.
    
    
    
     Executing test function test..xts_dimnames_in_dots ... done successfully.
    
    
    
     Executing test function test..xts_index_class_precedence ... done successfully.
    
    
    
     Executing test function test..xts_index_format_precedence ... done successfully.
    
    
    
     Executing test function test..xts_index_tzone_precedence ... done successfully.
    
    
    
     Executing test function test..xts_order.by_Inf_double ... Error in .xts(1:3, c(1, 2, Inf)) :
     'index' cannot contain 'NA', 'NaN', or 'Inf'
     In addition: There were 14 warnings (use warnings() to see them)
     Error in .xts(1:3, c(-Inf, 2, 3)) :
     'index' cannot contain 'NA', 'NaN', or 'Inf'
     done successfully.
    
    
    
     Executing test function test..xts_order.by_NA_double ... Error in .xts(1:3, c(1, 2, NA)) :
     'index' cannot contain 'NA', 'NaN', or 'Inf'
     Error in .xts(1:3, c(NA, 2, 3)) :
     'index' cannot contain 'NA', 'NaN', or 'Inf'
     Error in .xts(1:3, c(1, NA, 3)) :
     'index' cannot contain 'NA', 'NaN', or 'Inf'
     done successfully.
    
    
    
     Executing test function test..xts_order.by_NA_integer ... Error in .xts(1:3, c(1L, 2L, NA)) :
     'index' cannot contain 'NA', 'NaN', or 'Inf'
     Error in .xts(1:3, c(NA, 2L, 3L)) : index is not in increasing order
     Error in .xts(1:3, c(1L, NA, 3L)) : index is not in increasing order
     done successfully.
    
    
    
     Executing test function test..xts_order.by_NaN_double ... Error in .xts(1:3, c(1, 2, NaN)) :
     'index' cannot contain 'NA', 'NaN', or 'Inf'
     Error in .xts(1:3, c(NaN, 2, 3)) :
     'index' cannot contain 'NA', 'NaN', or 'Inf'
     Error in .xts(1:3, c(1, NaN, 3)) :
     'index' cannot contain 'NA', 'NaN', or 'Inf'
     done successfully.
    
    
    
     Executing test function test..xts_user_attributes ... done successfully.
    
    
    
     Executing test function test.ctors_dont_add_indexFORMAT_to_object ... done successfully.
    
    
    
     Executing test function test.ctors_dont_add_tclass_indexCLASS_to_object ... done successfully.
    
    
    
     Executing test function test.ctors_dont_add_tzone_indexTZ_to_object ... done successfully.
    
    
    
     Executing test function test.xts_ctor_warns_for_indexCLASS_arg ... Error in xts(1, as.Date("2018-05-02"), .indexCLASS = "Date") :
     (converted from warning) '.indexCLASS' is deprecated, use tclass instead.
     In addition: Warning messages:
     1: In .xts(1, 1, tformat = "%Y", .indexCLASS = "Date", .indexTZ = "UTC", :
     '.indexCLASS' is deprecated, use tclass instead.
     2: In .xts(1, 1, tformat = "%Y", .indexCLASS = "Date", .indexTZ = "UTC", :
     '.indexTZ' is deprecated and will be ignored, use tzone instead.
     Error in .xts(1, as.Date("2018-05-02"), .indexCLASS = "Date") :
     (converted from warning) '.indexCLASS' is deprecated, use tclass instead.
     done successfully.
    
    
    
     Executing test function test.xts_ctor_warns_for_indexFORMAT_arg ... Error in xts(1, as.Date("2018-05-02"), .indexFORMAT = "%Y") :
     (converted from warning) '.indexFORMAT' is deprecated, use tformat instead.
     Error in .xts(1, as.Date("2018-05-02"), .indexFORMAT = "%Y") :
     (converted from warning) '.indexFORMAT' is deprecated, use tformat instead.
     done successfully.
    
    
    
     Executing test function test.xts_ctor_warns_for_indexTZ_arg ... Error in xts(1, as.Date("2018-05-02"), .indexTZ = "UTC") :
     (converted from warning) '.indexTZ' is deprecated, use tzone instead.
     Error in .xts(1, as.Date("2018-05-02"), .indexTZ = "UTC") :
     (converted from warning) '.indexTZ' is deprecated and will be ignored, use tzone instead.
     done successfully.
    
    
    
     Executing test function test.xts_no_args_has_index_with_tzone_tclass ... done successfully.
    
    
    
     Executing test function test.xts_only_use_first_tzone_element ... done successfully.
    
    
    
     Executing test function test.xts_order.by_Inf_double ... Error in xts(1:3, .POSIXct(c(1, 2, Inf))) :
     'order.by' cannot contain 'NA', 'NaN', or 'Inf'
     Error in xts(1:3, .POSIXct(c(-Inf, 2, 3))) :
     'order.by' cannot contain 'NA', 'NaN', or 'Inf'
     done successfully.
    
    
    
     Executing test function test.xts_order.by_NA_double ... Error in xts(1:3, .POSIXct(c(1, 2, NA))) :
     'order.by' cannot contain 'NA', 'NaN', or 'Inf'
     Error in xts(1:3, .POSIXct(c(NA, 2, 3))) :
     'order.by' cannot contain 'NA', 'NaN', or 'Inf'
     Error in xts(1:3, .POSIXct(c(1, NA, 3))) :
     'order.by' cannot contain 'NA', 'NaN', or 'Inf'
     done successfully.
    
    
    
     Executing test function test.xts_order.by_NA_integer ... Error in xts(1:3, as.Date(c(1L, 2L, NA), origin = "1970-01-01")) :
     'order.by' cannot contain 'NA', 'NaN', or 'Inf'
     Error in xts(1:3, as.Date(c(NA, 2L, 3L), origin = "1970-01-01")) :
     'order.by' cannot contain 'NA', 'NaN', or 'Inf'
     Error in xts(1:3, as.Date(c(1L, NA, 3L), origin = "1970-01-01")) :
     'order.by' cannot contain 'NA', 'NaN', or 'Inf'
     done successfully.
    
    
    
     Executing test function test.xts_order.by_NaN_double ... Error in xts(1:3, .POSIXct(c(1, 2, NaN))) :
     'order.by' cannot contain 'NA', 'NaN', or 'Inf'
     Error in xts(1:3, .POSIXct(c(NaN, 2, 3))) :
     'order.by' cannot contain 'NA', 'NaN', or 'Inf'
     Error in xts(1:3, .POSIXct(c(1, NaN, 3))) :
     'order.by' cannot contain 'NA', 'NaN', or 'Inf'
     done successfully.
    
    
    
     Executing test function test.as.Date.numeric ... done successfully.
    
    
    
     Executing test function test.rbind_zero_length_non_zero_length_Date_errors ... done successfully.
    
    
    
     Executing test function test.rbind_zero_length_non_zero_length_POSIXct_errors ... done successfully.
    
    
    
     Executing test function test.subset_i_ISO8601 ... done successfully.
    
    
    
     Executing test function test.subset_i_datetime_or_character ... done successfully.
    
    
    
     Executing test function test.window ... Timing stopped at: 0.002 0 0.003
     Error in checkIdentical(bin, reg, "Range over gap") : FALSE
     Range over gap
     In addition: Warning messages:
     1: In RNGkind(kind = testSuite$rngKind, normal.kind = testSuite$rngNormalKind) :
     RNGkind: Marsaglia-Multicarry has poor statistical properties
     2: In RNGkind(kind = testSuite$rngKind, normal.kind = testSuite$rngNormalKind) :
     RNGkind: severe deviations from normality for Kinderman-Ramage + Marsaglia-Multicarry
     done successfully.
    
    
    
     Executing test function test.convert_zoo_to_xts ... done successfully.
    
    
    
     Executing test function test.convert_zoo_to_xts_i1 ... done successfully.
    
    
    
     Executing test function test.convert_zoo_to_xts_i1j1 ... done successfully.
    
    
    
     Executing test function test.convert_zoo_to_xts_j1 ... done successfully.
    
    
    
     Executing test function test.zoo_reclass_subset_as.xts_j1 ... done successfully.
    
    
    
     Executing test function test.zoo_reclass_subset_zoo_j1 ... done successfully.
    
     ------------------- UNIT TEST SUMMARY ---------------------
    
     RUNIT TEST PROTOCOL -- Sat Sep 18 23:42:00 2021
     ***********************************************
     Number of test functions: 432
     Number of errors: 0
     Number of failures: 1
    
    
     1 Test Suite :
     xts unit testing - 432 test functions, 0 errors, 1 failure
     FAILURE in test.window: Error in checkIdentical(bin, reg, "Range over gap") : FALSE
     Range over gap
     Error:
    
     unit testing failed (#test failures: 1, #R errors: 0)
    
     In addition: Warning messages:
     1: In RNGkind(kind = testSuite$rngKind, normal.kind = testSuite$rngNormalKind) :
     RNGkind: Marsaglia-Multicarry has poor statistical properties
     2: In RNGkind(kind = testSuite$rngKind, normal.kind = testSuite$rngNormalKind) :
     RNGkind: severe deviations from normality for Kinderman-Ramage + Marsaglia-Multicarry
     Execution halted
Flavor: r-devel-linux-x86_64-fedora-clang

Version: 0.12.1
Check: tests
Result: ERROR
     Running ‘doRUnit.R’ [11s/12s]
    Running the tests in ‘tests/doRUnit.R’ failed.
    Complete output:
     > ## unit tests will not be done if RUnit is not available
     > if(require("RUnit", quietly=TRUE)) {
     +
     + ## --- Setup ---
     + R_CMD_CHECK <- Sys.getenv("RCMDCHECK") != "FALSE"
     +
     + pkg <- "xts" # <-- Change to package name!
     + if (R_CMD_CHECK) {
     + ## Path to unit tests for R CMD check
     + ## PKG.Rcheck/tests/../PKG/unitTests
     + path <- system.file(package=pkg, "unitTests")
     + } else {
     + ## Path to unit tests for standalone running under Makefile (not R CMD check)
     + ## PKG/tests/../inst/unitTests
     + path <- file.path(getwd(), "..", "inst", "unitTests")
     + }
     + cat("\nRunning unit tests\n")
     + print(list(pkg=pkg, getwd=getwd(), pathToUnitTests=path))
     +
     + library(package=pkg, character.only=TRUE)
     +
     + ## If desired, load the name space to allow testing of private functions
     + ## if (is.element(pkg, loadedNamespaces()))
     + ## attach(loadNamespace(pkg), name=paste("namespace", pkg, sep=":"), pos=3)
     + ##
     + ## or simply call PKG:::myPrivateFunction() in tests
     +
     + ## --- Testing ---
     +
     + ## Define tests
     + testSuite <- defineTestSuite(name=paste(pkg, "unit testing"),
     + dirs=path)
     + ## Run
     + tests <- runTestSuite(testSuite)
     +
     + ## Report to stdout
     + cat("------------------- UNIT TEST SUMMARY ---------------------\n\n")
     + printTextProtocol(tests, showDetails=FALSE)
     +
     + ## Report text files (only if not under R CMD check)
     + if (!R_CMD_CHECK) {
     + ## Default report name
     + pathReport <- file.path(path, "report")
     +
     + printTextProtocol(tests, showDetails=FALSE,
     + fileName=paste(pathReport, "Summary.txt", sep=""))
     + printTextProtocol(tests, showDetails=TRUE,
     + fileName=paste(pathReport, ".txt", sep=""))
     +
     + ## Report to HTML file
     + printHTMLProtocol(tests, fileName=paste(pathReport, ".html", sep=""))
     + }
     +
     + ## Return stop() to cause R CMD check stop in case of
     + ## - failures i.e. FALSE to unit tests or
     + ## - errors i.e. R errors
     + tmp <- getErrors(tests)
     + if(tmp$nFail > 0 | tmp$nErr > 0) {
     + stop(paste("\n\nunit testing failed (#test failures: ", tmp$nFail,
     + ", #R errors: ", tmp$nErr, ")\n\n", sep=""))
     + }
     + } else {
     + warning("cannot run unit tests -- package RUnit is not available")
     + }
    
     Running unit tests
     $pkg
     [1] "xts"
    
     $getwd
     [1] "/data/gannet/ripley/R/packages/tests-devel/xts.Rcheck/tests"
    
     $pathToUnitTests
     [1] "/data/gannet/ripley/R/packages/tests-devel/xts.Rcheck/xts/unitTests"
    
     Loading required package: zoo
    
     Attaching package: 'zoo'
    
     The following objects are masked from 'package:base':
    
     as.Date, as.Date.numeric
    
    
    
     Executing test function test.get_tclass_POSIXct_ts2 ... done successfully.
    
    
    
     Executing test function test.get_tclass_ts1 ... done successfully.
    
    
    
     Executing test function test.get_tzone_ts2 ... done successfully.
    
    
    
     Executing test function test.ops_xts1d_matrix1d_dimnames ... done successfully.
    
    
    
     Executing test function test.ops_xts1d_matrix1d_no_dimnames ... done successfully.
    
    
    
     Executing test function test.ops_xts1d_matrix1d_only_colnames ... done successfully.
    
    
    
     Executing test function test.ops_xts1d_matrix1d_only_rownames ... done successfully.
    
    
    
     Executing test function test.ops_xts1d_vector_names ... done successfully.
    
    
    
     Executing test function test.ops_xts1d_vector_no_names ... done successfully.
    
    
    
     Executing test function test.ops_xts1d_xts1d ... done successfully.
    
    
    
     Executing test function test.ops_xts1d_xts1d_different_index ... done successfully.
    
    
    
     Executing test function test.ops_xts2d_matrix2d_dimnames ... done successfully.
    
    
    
     Executing test function test.ops_xts2d_matrix2d_no_dimnames ... done successfully.
    
    
    
     Executing test function test.ops_xts2d_matrix2d_only_colnames ... done successfully.
    
    
    
     Executing test function test.ops_xts2d_matrix2d_only_rownames ... done successfully.
    
    
    
     Executing test function test.ops_xts2d_vector_names ... done successfully.
    
    
    
     Executing test function test.ops_xts2d_vector_no_names ... done successfully.
    
    
    
     Executing test function test.ops_xts_no_dim_matrix1d ... done successfully.
    
    
    
     Executing test function test.ops_xts_no_dim_matrix2d ... done successfully.
    
    
    
     Executing test function test.ops_xts_no_dim_vector ... done successfully.
    
    
    
     Executing test function test.tclass_POSIXct_after_rel_op ... done successfully.
    
    
    
     Executing test function test.tclass_after_rel_op ... done successfully.
    
    
    
     Executing test function test.tzone_after_rel_op ... done successfully.
    
    
    
     Executing test function test.make.index.unique_1us_default_eps ... done successfully.
    
    
    
     Executing test function test.make.index.unique_adds_eps_to_duplicates ... done successfully.
    
    
    
     Executing test function test.make.index.unique_converts_date_index_to_POSIXct ... done successfully.
    
    
    
     Executing test function test.make.index.unique_no_warn_if_unique_timestamps_unchanged ... done successfully.
    
    
    
     Executing test function test.make.index.unique_returns_sorted_index ... done successfully.
    
    
    
     Executing test function test.make.index.unique_warns_ONCE_if_unique_timestamp_changes ... done successfully.
    
    
    
     Executing test function test.make.index.unique_warns_if_unique_timestamp_changes ... Error in make.index.unique.xts(x, eps = eps) :
     (converted from warning) index value is unique but will be replaced; it is less than the cumulative epsilon for the preceding duplicate index values
     In addition: Warning messages:
     1: In RNGkind(kind = testSuite$rngKind, normal.kind = testSuite$rngNormalKind) :
     RNGkind: Marsaglia-Multicarry has poor statistical properties
     2: In RNGkind(kind = testSuite$rngKind, normal.kind = testSuite$rngNormalKind) :
     RNGkind: severe deviations from normality for Kinderman-Ramage + Marsaglia-Multicarry
     3: In RNGkind(kind = testSuite$rngKind, normal.kind = testSuite$rngNormalKind) :
     RNGkind: Marsaglia-Multicarry has poor statistical properties
     4: In RNGkind(kind = testSuite$rngKind, normal.kind = testSuite$rngNormalKind) :
     RNGkind: severe deviations from normality for Kinderman-Ramage + Marsaglia-Multicarry
     5: In make.index.unique.xts(x, eps = 1e-06) :
     index value is unique but will be replaced; it is less than the cumulative epsilon for the preceding duplicate index values
     6: In make.index.unique.xts(x, eps = eps) :
     index value is unique but will be replaced; it is less than the cumulative epsilon for the preceding duplicate index values
     done successfully.
    
    
    
     Executing test function test.attr_on_object_equal_to_attr_on_index ... done successfully.
    
    
    
     Executing test function test.double_with_small_delta_stops ... done successfully.
    
    
    
     Executing test function test.find_first_zero_even_length ... done successfully.
    
    
    
     Executing test function test.find_first_zero_odd_length ... done successfully.
    
    
    
     Executing test function test.find_last_zero_even_length ... done successfully.
    
    
    
     Executing test function test.find_last_zero_odd_length ... done successfully.
    
    
    
     Executing test function test.integer_predicate_no_yes_stops ... done successfully.
    
    
    
     Executing test function test.key_greater_than_max ... done successfully.
    
    
    
     Executing test function test.key_is_NA ... done successfully.
    
    
    
     Executing test function test.key_is_zero_length ... done successfully.
    
    
    
     Executing test function test.key_less_than_min ... done successfully.
    
    
    
     Executing test function test.vec_is_zero_length ... done successfully.
    
    
    
     Executing test function test.coredata_data.frame ... done successfully.
    
    
    
     Executing test function test.coredata_empty ... done successfully.
    
    
    
     Executing test function test.coredata_empty_dim ... done successfully.
    
    
    
     Executing test function test.coredata_empty_dim_dimnames ... done successfully.
    
    
    
     Executing test function test.coredata_matrix ... done successfully.
    
    
    
     Executing test function test.coredata_named_matrix ... done successfully.
    
    
    
     Executing test function test.coredata_named_vector ... done successfully.
    
    
    
     Executing test function test.coredata_ts ... done successfully.
    
    
    
     Executing test function test.coredata_vector ... done successfully.
    
    
    
     Executing test function test.convert_data.frame_to_xts ... done successfully.
    
    
    
     Executing test function test.convert_data.frame_to_xts_i1 ... done successfully.
    
    
    
     Executing test function test.convert_data.frame_to_xts_i1j1 ... done successfully.
    
    
    
     Executing test function test.convert_data.frame_to_xts_j1 ... done successfully.
    
    
    
     Executing test function test.convert_data.frame_to_xts_order.by_Date ... done successfully.
    
    
    
     Executing test function test.convert_data.frame_to_xts_order.by_POSIXct ... done successfully.
    
    
    
     Executing test function test.convert_data.frame_to_xts_order.by_POSIXlt ... done successfully.
    
    
    
     Executing test function test.data.frame_reclass ... done successfully.
    
    
    
     Executing test function test.data.frame_reclass_subset_as.xts_j1 ... done successfully.
    
    
    
     Executing test function test.data.frame_reclass_subset_data.frame_j1 ... Error in try.xts(sample.data.frame[, 1]) :
     Error in as.xts.double(x, ..., .RECLASS = TRUE) : order.by must be either 'names()' or otherwise specified
     In addition: Warning messages:
     1: In RNGkind(kind = testSuite$rngKind, normal.kind = testSuite$rngNormalKind) :
     RNGkind: Marsaglia-Multicarry has poor statistical properties
     2: In RNGkind(kind = testSuite$rngKind, normal.kind = testSuite$rngNormalKind) :
     RNGkind: severe deviations from normality for Kinderman-Ramage + Marsaglia-Multicarry
     3: In RNGkind(kind = testSuite$rngKind, normal.kind = testSuite$rngNormalKind) :
     RNGkind: Marsaglia-Multicarry has poor statistical properties
     4: In RNGkind(kind = testSuite$rngKind, normal.kind = testSuite$rngNormalKind) :
     RNGkind: severe deviations from normality for Kinderman-Ramage + Marsaglia-Multicarry
     5: In RNGkind(kind = testSuite$rngKind, normal.kind = testSuite$rngNormalKind) :
     RNGkind: Marsaglia-Multicarry has poor statistical properties
     6: In RNGkind(kind = testSuite$rngKind, normal.kind = testSuite$rngNormalKind) :
     RNGkind: severe deviations from normality for Kinderman-Ramage + Marsaglia-Multicarry
     7: In RNGkind(kind = testSuite$rngKind, normal.kind = testSuite$rngNormalKind) :
     RNGkind: Marsaglia-Multicarry has poor statistical properties
     8: In RNGkind(kind = testSuite$rngKind, normal.kind = testSuite$rngNormalKind) :
     RNGkind: severe deviations from normality for Kinderman-Ramage + Marsaglia-Multicarry
     done successfully.
    
    
    
     Executing test function test.data.frame_reclass_subset_reclass_j1 ... done successfully.
    
    
    
     Executing test function test.diff_differences_LT1 ... Error in diff.xts(x, 1L, -1L) :
     'diff.xts' defined only for positive lag and differences arguments
     In addition: Warning messages:
     1: In RNGkind(kind = testSuite$rngKind, normal.kind = testSuite$rngNormalKind) :
     RNGkind: Marsaglia-Multicarry has poor statistical properties
     2: In RNGkind(kind = testSuite$rngKind, normal.kind = testSuite$rngNormalKind) :
     RNGkind: severe deviations from normality for Kinderman-Ramage + Marsaglia-Multicarry
     done successfully.
    
    
    
     Executing test function test.diff_differences_NA ... Error in diff.xts(x, 1L, "a") : 'differences' must be integer
     In addition: Warning message:
     In diff.xts(x, 1L, "a") : NAs introduced by coercion
     done successfully.
    
    
    
     Executing test function test.diff_integer_Date ... done successfully.
    
    
    
     Executing test function test.diff_integer_POSIXt ... done successfully.
    
    
    
     Executing test function test.diff_lag_LT1 ... Error in diff.xts(x, -1L, 1L) :
     'diff.xts' defined only for positive lag and differences arguments
     done successfully.
    
    
    
     Executing test function test.diff_lag_NA ... Error in diff.xts(x, "a", 1L) : 'lag' must be integer
     In addition: Warning message:
     In diff.xts(x, "a", 1L) : NAs introduced by coercion
     done successfully.
    
    
    
     Executing test function test.diff_logical_Date ... done successfully.
    
    
    
     Executing test function test.diff_logical_POSIXt ... done successfully.
    
    
    
     Executing test function test.diff_logical_preserves_colnames ... done successfully.
    
    
    
     Executing test function test.diff_numeric_Date ... done successfully.
    
    
    
     Executing test function test.diff_numeric_POSIXt ... done successfully.
    
    
    
     Executing test function test.days_double_index ... done successfully.
    
    
    
     Executing test function test.days_integer_index ... done successfully.
    
    
    
     Executing test function test.double_index_cross_epoch ... done successfully.
    
    
    
     Executing test function test.hours_double_index ... done successfully.
    
    
    
     Executing test function test.hours_integer_index ... done successfully.
    
    
    
     Executing test function test.integer_index_cross_epoch ... done successfully.
    
    
    
     Executing test function test.minutes_double_index ... done successfully.
    
    
    
     Executing test function test.minutes_integer_index ... done successfully.
    
    
    
     Executing test function test.minutes_mins ... done successfully.
    
    
    
     Executing test function test.months_double_index ... done successfully.
    
    
    
     Executing test function test.months_integer_index ... done successfully.
    
    
    
     Executing test function test.multiple_quarters ... done successfully.
    
    
    
     Executing test function test.quarters_double_index ... done successfully.
    
    
    
     Executing test function test.quarters_integer_index ... done successfully.
    
    
    
     Executing test function test.seconds_double_index ... done successfully.
    
    
    
     Executing test function test.seconds_integer_index ... done successfully.
    
    
    
     Executing test function test.seconds_secs ... done successfully.
    
    
    
     Executing test function test.sparse_days ... done successfully.
    
    
    
     Executing test function test.sparse_months ... done successfully.
    
    
    
     Executing test function test.sparse_quarters ... done successfully.
    
    
    
     Executing test function test.sparse_weeks ... done successfully.
    
    
    
     Executing test function test.sparse_years ... done successfully.
    
    
    
     Executing test function test.sub_second_resolution ... done successfully.
    
    
    
     Executing test function test.sub_second_resolution_exact ... done successfully.
    
    
    
     Executing test function test.sub_second_resolution_representation ... done successfully.
    
    
    
     Executing test function test.weeks_double_index ... done successfully.
    
    
    
     Executing test function test.weeks_integer_index ... done successfully.
    
    
    
     Executing test function test.years_double_index ... done successfully.
    
    
    
     Executing test function test.years_integer_index ... done successfully.
    
    
    
     Executing test function test.first_nonxtsible_data.frame_neg_n ... done successfully.
    
    
    
     Executing test function test.first_nonxtsible_data.frame_pos_n ... done successfully.
    
    
    
     Executing test function test.first_nonxtsible_matrix_neg_n ... done successfully.
    
    
    
     Executing test function test.first_nonxtsible_matrix_pos_n ... done successfully.
    
    
    
     Executing test function test.first_nonxtsible_vector ... done successfully.
    
    
    
     Executing test function test.first_xtsible_data.frame_neg_n ... done successfully.
    
    
    
     Executing test function test.first_xtsible_data.frame_pos_n ... done successfully.
    
    
    
     Executing test function test.first_xtsible_matrix_neg_n ... done successfully.
    
    
    
     Executing test function test.first_xtsible_matrix_pos_n ... done successfully.
    
    
    
     Executing test function test.first_xtsible_vector ... done successfully.
    
    
    
     Executing test function test.first_zoo_neg_n ... done successfully.
    
    
    
     Executing test function test.first_zoo_pos_n ... done successfully.
    
    
    
     Executing test function test.last_nonxtsible_data.frame_neg_n ... done successfully.
    
    
    
     Executing test function test.last_nonxtsible_data.frame_pos_n ... done successfully.
    
    
    
     Executing test function test.last_nonxtsible_matrix_neg_n ... done successfully.
    
    
    
     Executing test function test.last_nonxtsible_matrix_pos_n ... done successfully.
    
    
    
     Executing test function test.last_nonxtsible_vector ... done successfully.
    
    
    
     Executing test function test.last_xtsible_data.frame_neg_n ... done successfully.
    
    
    
     Executing test function test.last_xtsible_data.frame_pos_n ... done successfully.
    
    
    
     Executing test function test.last_xtsible_matrix_neg_n ... done successfully.
    
    
    
     Executing test function test.last_xtsible_matrix_pos_n ... done successfully.
    
    
    
     Executing test function test.last_xtsible_vector ... done successfully.
    
    
    
     Executing test function test.last_zoo_neg_n ... done successfully.
    
    
    
     Executing test function test.last_zoo_pos_n ... done successfully.
    
    
    
     Executing test function test.zero_length_vector ... done successfully.
    
    
    
     Executing test function test.zero_row_matrix ... done successfully.
    
    
    
     Executing test function test.convert_fts12_to_xts ... done successfully.
    
    
    
     Executing test function test.convert_fts12_to_xts_i1 ... done successfully.
    
    
    
     Executing test function test.convert_fts12_to_xts_i1j1 ... done successfully.
    
    
    
     Executing test function test.convert_fts12_to_xts_j1 ... done successfully.
    
    
    
     Executing test function test.convert_fts4_to_xts ... done successfully.
    
    
    
     Executing test function test.convert_fts4_to_xts_i1 ... done successfully.
    
    
    
     Executing test function test.convert_fts4_to_xts_i1j1 ... done successfully.
    
    
    
     Executing test function test.convert_fts4_to_xts_j1 ... done successfully.
    
    
    
     Executing test function test.convert_fts_to_xts ... done successfully.
    
    
    
     Executing test function test.convert_fts_to_xts_i1 ... done successfully.
    
    
    
     Executing test function test.convert_fts_to_xts_i1j1 ... done successfully.
    
    
    
     Executing test function test.convert_fts_to_xts_j1 ... done successfully.
    
    
    
     Executing test function test.fts12_reclass ... done successfully.
    
    
    
     Executing test function test.fts12_reclass_subset_as.xfts_j1 ... done successfully.
    
    
    
     Executing test function test.fts12_reclass_subset_fts_j1 ... done successfully.
    
    
    
     Executing test function test.fts12_reclass_subset_reclass_j1 ... done successfully.
    
    
    
     Executing test function test.fts4_reclass ... done successfully.
    
    
    
     Executing test function test.fts4_reclass_subset_as.xts_j1 ... done successfully.
    
    
    
     Executing test function test.fts4_reclass_subset_fts_j1 ... done successfully.
    
    
    
     Executing test function test.fts4_reclass_subset_reclass_j1 ... done successfully.
    
    
    
     Executing test function test.fts_reclass ... done successfully.
    
    
    
     Executing test function test.fts_reclass_subset_as.xts_j1 ... done successfully.
    
    
    
     Executing test function test.fts_reclass_subset_fts_j1 ... done successfully.
    
    
    
     Executing test function test.fts_reclass_subset_reclass_j1 ... done successfully.
    
    
    
     Executing test function test.get_index_does_not_error_if_index_has_no_attributes ... done successfully.
    
    
    
     Executing test function test.set_.index_copies_index_attributes ... done successfully.
    
    
    
     Executing test function test.set_index_copies_index_attributes ... done successfully.
    
    
    
     Executing test function test.set_index_restores_tzone_attribute ... done successfully.
    
    
    
     Executing test function test.checkUTC_set_index2Date ... done successfully.
    
    
    
     Executing test function test.checkUTC_set_index2chron ... done successfully.
    
    
    
     Executing test function test.checkUTC_set_index2yearmon ... done successfully.
    
    
    
     Executing test function test.checkUTC_set_index2yearqtr ... done successfully.
    
    
    
     Executing test function test.convert_Date2Date ... done successfully.
    
    
    
     Executing test function test.convert_Date2POSIXct ... done successfully.
    
    
    
     Executing test function test.convert_Date2chron ... done successfully.
    
    
    
     Executing test function test.convert_Date2timeDate ... done successfully.
    
    
    
     Executing test function test.convert_Date2yearmon ... done successfully.
    
    
    
     Executing test function test.convert_Date2yearqtr ... done successfully.
    
    
    
     Executing test function test.convert_POSIXct2Date ... done successfully.
    
    
    
     Executing test function test.convert_POSIXct2POSIXct ... done successfully.
    
    
    
     Executing test function test.convert_POSIXct2chron ... done successfully.
    
    
    
     Executing test function test.convert_POSIXct2timeDate ... done successfully.
    
    
    
     Executing test function test.convert_POSIXct2yearmon ... done successfully.
    
    
    
     Executing test function test.convert_POSIXct2yearqtr ... done successfully.
    
    
    
     Executing test function test.convert_chron2Date ... done successfully.
    
    
    
     Executing test function test.convert_chron2POSIXct ... done successfully.
    
    
    
     Executing test function test.convert_chron2chron ... done successfully.
    
    
    
     Executing test function test.convert_chron2timeDate ... done successfully.
    
    
    
     Executing test function test.convert_chron2yearmon ... done successfully.
    
    
    
     Executing test function test.convert_chron2yearqtr ... done successfully.
    
    
    
     Executing test function test.convert_timeDate2Date ... done successfully.
    
    
    
     Executing test function test.convert_timeDate2POSIXct ... done successfully.
    
    
    
     Executing test function test.convert_timeDate2chron ... done successfully.
    
    
    
     Executing test function test.convert_timeDate2timeDate ... done successfully.
    
    
    
     Executing test function test.convert_timeDate2yearmon ... done successfully.
    
    
    
     Executing test function test.convert_timeDate2yearqtr ... done successfully.
    
    
    
     Executing test function test.convert_yearmon2Date ... done successfully.
    
    
    
     Executing test function test.convert_yearmon2POSIXct ... done successfully.
    
    
    
     Executing test function test.convert_yearmon2chron ... done successfully.
    
    
    
     Executing test function test.convert_yearmon2timeDate ... done successfully.
    
    
    
     Executing test function test.convert_yearmon2yearmon ... done successfully.
    
    
    
     Executing test function test.convert_yearmon2yearqtr ... done successfully.
    
    
    
     Executing test function test.convert_yearqtr2Date ... done successfully.
    
    
    
     Executing test function test.convert_yearqtr2POSIXct ... done successfully.
    
    
    
     Executing test function test.convert_yearqtr2chron ... done successfully.
    
    
    
     Executing test function test.convert_yearqtr2timeDate ... done successfully.
    
    
    
     Executing test function test.convert_yearqtr2yearmon ... done successfully.
    
    
    
     Executing test function test.convert_yearqtr2yearqtr ... done successfully.
    
    
    
     Executing test function test.indexClass_NULL ... Error in `tclass<-.xts`(x, value) : improperly specified value for tclass
     In addition: There were 50 or more warnings (use warnings() to see the first 50)
     done successfully.
    
    
    
     Executing test function test.indexClass_empty_string ... Error in `tclass<-.xts`(x, value) : unsupported 'tclass' indexing type:
     In addition: Warning message:
     'indexClass<-' is deprecated.
     Use 'tclass<-' instead.
     See help("Deprecated") and help("xts-deprecated").
     done successfully.
    
    
    
     Executing test function test.indexClass_full_index ... Error in `tclass<-.xts`(x, value) : improperly specified value for tclass
     In addition: Warning message:
     'indexClass<-' is deprecated.
     Use 'tclass<-' instead.
     See help("Deprecated") and help("xts-deprecated").
     done successfully.
    
    
    
     Executing test function test.indexClass_missing_object ... Error in eval(expr, envir = parent.frame()) : object 'Date' not found
     In addition: Warning message:
     In rm(Date) : object 'Date' not found
     done successfully.
    
    
    
     Executing test function test.indexClass_unquoted_symbol ... Error in h(simpleError(msg, call)) :
     error in evaluating the argument 'i' in selecting a method for function '[': 'match' requires vector arguments
     In addition: Warning message:
     'indexClass<-' is deprecated.
     Use 'tclass<-' instead.
     See help("Deprecated") and help("xts-deprecated").
     done successfully.
    
    
    
     Executing test function test.convert_irts_to_xts ... done successfully.
    
    
    
     Executing test function test.convert_irts_to_xts_i1 ... done successfully.
    
    
    
     Executing test function test.convert_irts_to_xts_i1j1 ... done successfully.
    
    
    
     Executing test function test.convert_irts_to_xts_j1 ... done successfully.
    
    
    
     Executing test function test.isOrdered_decr ... done successfully.
    
    
    
     Executing test function test.isOrdered_decr_begNA ... done successfully.
    
    
    
     Executing test function test.isOrdered_decr_endNA ... done successfully.
    
    
    
     Executing test function test.isOrdered_decr_midNA ... done successfully.
    
    
    
     Executing test function test.isOrdered_incr ... done successfully.
    
    
    
     Executing test function test.isOrdered_incr_begNA ... done successfully.
    
    
    
     Executing test function test.isOrdered_incr_endNA ... done successfully.
    
    
    
     Executing test function test.isOrdered_incr_midNA ... done successfully.
    
    
    
     Executing test function test.lag_integer_Date ... done successfully.
    
    
    
     Executing test function test.lag_integer_POSIXt ... done successfully.
    
    
    
     Executing test function test.lag_k_NA ... done successfully.
    
    
    
     Executing test function test.lag_k_zero_length ... done successfully.
    
    
    
     Executing test function test.lag_logical_Date ... done successfully.
    
    
    
     Executing test function test.lag_logical_POSIXt ... done successfully.
    
    
    
     Executing test function test.lag_numeric_Date ... done successfully.
    
    
    
     Executing test function test.lag_numeric_POSIXt ... done successfully.
    
    
    
     Executing test function test.convert_matrix_to_xts ... done successfully.
    
    
    
     Executing test function test.convert_matrix_to_xts_i1 ... done successfully.
    
    
    
     Executing test function test.convert_matrix_to_xts_i1j1 ... done successfully.
    
    
    
     Executing test function test.convert_matrix_to_xts_j1 ... done successfully.
    
    
    
     Executing test function test.dimless_xts_to_matrix ... done successfully.
    
    
    
     Executing test function test.matrix_reclass ... done successfully.
    
    
    
     Executing test function test.matrix_reclass_subset_as.xts_j1 ... done successfully.
    
    
    
     Executing test function test.matrix_reclass_subset_matrix_j1 ... done successfully.
    
    
    
     Executing test function test.matrix_reclass_subset_reclass_j1 ... done successfully.
    
    
    
     Executing test function test.zero_width_xts_to_matrix ... done successfully.
    
    
    
     Executing test function test.check_names_false ... done successfully.
    
    
    
     Executing test function test.merge_empty_xts_with_2_scalars ... done successfully.
    
    
    
     Executing test function test.merge_fill_NULL ... done successfully.
    
    
    
     Executing test function test.merge_fill_zero_length ... done successfully.
    
    
    
     Executing test function test.merge_index_contains_Inf ... done successfully.
    
    
    
     Executing test function test.merge_index_contains_NA_double ... done successfully.
    
    
    
     Executing test function test.merge_index_contains_NA_integer ... done successfully.
    
    
    
     Executing test function test.merge_index_contains_NaN ... done successfully.
    
    
    
     Executing test function test.merge_more_than_2_zero_width_objects ... done successfully.
    
    
    
     Executing test function test.merge_with_zero_width_returns_original_type ... done successfully.
    
    
    
     Executing test function test.n_way_merge_on_all_types ... done successfully.
    
    
    
     Executing test function test.shorter_colnames_for_unnamed_args ... done successfully.
    
    
    
     Executing test function test.nalocf ... done successfully.
    
    
    
     Executing test function test.nalocf_by_column ... done successfully.
    
    
    
     Executing test function test.nalocf_by_column_1NA ... done successfully.
    
    
    
     Executing test function test.nalocf_by_column_1NA_fromLast ... done successfully.
    
    
    
     Executing test function test.nalocf_by_column_fromLast ... done successfully.
    
    
    
     Executing test function test.nalocf_by_column_leading_NA ... done successfully.
    
    
    
     Executing test function test.nalocf_by_column_x ... done successfully.
    
    
    
     Executing test function test.nalocf_by_column_xout ... done successfully.
    
    
    
     Executing test function test.nalocf_first_column_all_NA ... done successfully.
    
    
    
     Executing test function test.nalocf_fromLast ... done successfully.
    
    
    
     Executing test function test.nalocf_last_column_all_NA ... done successfully.
    
    
    
     Executing test function test.nalocf_leading_NA ... done successfully.
    
    
    
     Executing test function test.nalocf_x ... done successfully.
    
    
    
     Executing test function test.nalocf_xout ... done successfully.
    
    
    
     Executing test function test.naomit ... done successfully.
    
    
    
     Executing test function test.naomit_by_column ... done successfully.
    
    
    
     Executing test function test.all_dates ... done successfully.
    
    
    
     Executing test function test.end_date_is_garbage ... done successfully.
    
    
    
     Executing test function test.left_open_to_end ... done successfully.
    
    
    
     Executing test function test.single_date ... done successfully.
    
    
    
     Executing test function test.single_date_is_garbage ... done successfully.
    
    
    
     Executing test function test.start_date_is_garbage ... done successfully.
    
    
    
     Executing test function test.start_end_dates_are_garbage ... done successfully.
    
    
    
     Executing test function test.start_end_dates_do_not_exist ... done successfully.
    
    
    
     Executing test function test.start_to_right_open ... done successfully.
    
    
    
     Executing test function test.INDEX_ends_with_lengthX ... done successfully.
    
    
    
     Executing test function test.INDEX_ends_with_lengthX_vector ... done successfully.
    
    
    
     Executing test function test.INDEX_starts_with_zero ... done successfully.
    
    
    
     Executing test function test.INDEX_starts_with_zero_vector ... done successfully.
    
    
    
     Executing test function test.duplicate_INDEX ... done successfully.
    
    
    
     Executing test function test.duplicate_INDEX_vector ... done successfully.
    
    
    
     Executing test function test.intraday_to_daily ... done successfully.
    
    
    
     Executing test function test.period.max_converts_index_to_integer ... done successfully.
    
    
    
     Executing test function test.period.max_equals_apply.monthly ... done successfully.
    
    
    
     Executing test function test.period.min_converts_index_to_integer ... done successfully.
    
    
    
     Executing test function test.period.min_equals_apply.monthly ... done successfully.
    
    
    
     Executing test function test.period.prod_converts_index_to_integer ... done successfully.
    
    
    
     Executing test function test.period.prod_equals_apply.monthly ... done successfully.
    
    
    
     Executing test function test.period.sum_converts_index_to_integer ... done successfully.
    
    
    
     Executing test function test.period.sum_equals_apply.monthly ... done successfully.
    
    
    
     Executing test function test.unsorted_INDEX ... done successfully.
    
    
    
     Executing test function test.unsorted_INDEX_vector ... done successfully.
    
    
    
     Executing test function test.periodicity_on_one_observation_warns ... Error in periodicity(x) :
     (converted from warning) can not calculate periodicity of 1 observation
     In addition: There were 34 warnings (use warnings() to see them)
     done successfully.
    
    
    
     Executing test function test.periodicity_on_zero_observations_warns ... Error in periodicity(x) :
     (converted from warning) can not calculate periodicity of empty object
     In addition: Warning message:
     In periodicity(x) : can not calculate periodicity of empty object
     done successfully.
    
    
    
     Executing test function test.axTicksByTime_ticks.on_quarter ... done successfully.
    
    
    
     Executing test function test.format_xts_yearqtr ... done successfully.
    
    
    
     Executing test function test.format_zoo_yearqtr ... done successfully.
    
    
    
     Executing test function test.reclass_preserves_match.to_tclass ... done successfully.
    
    
    
     Executing test function test.reclass_preserves_match.to_tformat ... done successfully.
    
    
    
     Executing test function test.reclass_preserves_match.to_tzone ... done successfully.
    
    
    
     Executing test function test.split_character_f_not_endpoints ... done successfully.
    
    
    
     Executing test function test.time_of_day_by_hour_start_equals_end ... done successfully.
    
    
    
     Executing test function test.time_of_day_by_minute ... done successfully.
    
    
    
     Executing test function test.time_of_day_by_second ... done successfully.
    
    
    
     Executing test function test.time_of_day_check_time_string ... done successfully.
    
    
    
     Executing test function test.time_of_day_end_before_start ... done successfully.
    
    
    
     Executing test function test.time_of_day_on_zero_width ... done successfully.
    
    
    
     Executing test function test.time_of_day_start_equals_end ... done successfully.
    
    
    
     Executing test function test.time_of_day_when_DST_ends ... done successfully.
    
    
    
     Executing test function test.time_of_day_when_DST_starts ... done successfully.
    
    
    
     Executing test function test.time_of_day_zero_padding ... Error : Supply time-of-day subsetting in the format of T%H:%M:%OS/T%H:%M:%OS
     In addition: Warning messages:
     1: In RNGkind(kind = testSuite$rngKind, normal.kind = testSuite$rngNormalKind) :
     RNGkind: Marsaglia-Multicarry has poor statistical properties
     2: In RNGkind(kind = testSuite$rngKind, normal.kind = testSuite$rngNormalKind) :
     RNGkind: severe deviations from normality for Kinderman-Ramage + Marsaglia-Multicarry
     3: In RNGkind(kind = testSuite$rngKind, normal.kind = testSuite$rngNormalKind) :
     RNGkind: Marsaglia-Multicarry has poor statistical properties
     4: In RNGkind(kind = testSuite$rngKind, normal.kind = testSuite$rngNormalKind) :
     RNGkind: severe deviations from normality for Kinderman-Ramage + Marsaglia-Multicarry
     5: In RNGkind(kind = testSuite$rngKind, normal.kind = testSuite$rngNormalKind) :
     RNGkind: Marsaglia-Multicarry has poor statistical properties
     6: In RNGkind(kind = testSuite$rngKind, normal.kind = testSuite$rngNormalKind) :
     RNGkind: severe deviations from normality for Kinderman-Ramage + Marsaglia-Multicarry
     7: In RNGkind(kind = testSuite$rngKind, normal.kind = testSuite$rngNormalKind) :
     RNGkind: Marsaglia-Multicarry has poor statistical properties
     8: In RNGkind(kind = testSuite$rngKind, normal.kind = testSuite$rngNormalKind) :
     RNGkind: severe deviations from normality for Kinderman-Ramage + Marsaglia-Multicarry
     Error : Supply time-of-day subsetting in the format of T%H:%M:%OS/T%H:%M:%OS
     done successfully.
    
    
    
     Executing test function test.duplicate_index_duplicate_i ... done successfully.
    
    
    
     Executing test function test.empty_i_NA ... done successfully.
    
    
    
     Executing test function test.empty_i_NULL ... done successfully.
    
    
    
     Executing test function test.empty_i_datetime ... done successfully.
    
    
    
     Executing test function test.empty_i_negative ... done successfully.
    
    
    
     Executing test function test.empty_i_zero ... done successfully.
    
    
    
     Executing test function test.i_0 ... done successfully.
    
    
    
     Executing test function test.i_Date ... done successfully.
    
    
    
     Executing test function test.i_POSIXct ... done successfully.
    
    
    
     Executing test function test.i_POSIXlt ... done successfully.
    
    
    
     Executing test function test.i_asis_character ... done successfully.
    
    
    
     Executing test function test.i_character ... done successfully.
    
    
    
     Executing test function test.i_date_range_open_end ... done successfully.
    
    
    
     Executing test function test.i_date_range_open_start ... done successfully.
    
    
    
     Executing test function test.i_integer_j_NA_has_colnames ... done successfully.
    
    
    
     Executing test function test.i_integer_j_NA_no_colnames ... done successfully.
    
    
    
     Executing test function test.i_invalid_date_string ... done successfully.
    
    
    
     Executing test function test.i_missing_j_NA_has_colnames ... done successfully.
    
    
    
     Executing test function test.i_missing_j_NA_no_colnames ... done successfully.
    
    
    
     Executing test function test.i_only_range_separator_or_empty_string ... done successfully.
    
    
    
     Executing test function test.get_coredata_drops_xts_tclass_indexCLASS ... done successfully.
    
    
    
     Executing test function test.get_indexClass_warns ... Error : (converted from warning) 'indexClass' is deprecated.
     Use 'tclass' instead.
     See help("Deprecated") and help("xts-deprecated").
     In addition: Warning messages:
     1: In RNGkind(kind = testSuite$rngKind, normal.kind = testSuite$rngNormalKind) :
     RNGkind: Marsaglia-Multicarry has poor statistical properties
     2: In RNGkind(kind = testSuite$rngKind, normal.kind = testSuite$rngNormalKind) :
     RNGkind: severe deviations from normality for Kinderman-Ramage + Marsaglia-Multicarry
     3: In .parseISO8601(ii, .index(x)[1], .index(x)[nr], tz = tz) :
     cannot determine first and last time from 2012-02-30/2012-02-30
     4: In RNGkind(kind = testSuite$rngKind, normal.kind = testSuite$rngNormalKind) :
     RNGkind: Marsaglia-Multicarry has poor statistical properties
     5: In RNGkind(kind = testSuite$rngKind, normal.kind = testSuite$rngNormalKind) :
     RNGkind: severe deviations from normality for Kinderman-Ramage + Marsaglia-Multicarry
     done successfully.
    
    
    
     Executing test function test.get_tclass ... done successfully.
    
    
    
     Executing test function test.get_xtsAttributes_excludes_tclass_indexCLASS ... done successfully.
    
    
    
     Executing test function test.set_indexClass_warns ... Error : (converted from warning) 'indexClass<-' is deprecated.
     Use 'tclass<-' instead.
     See help("Deprecated") and help("xts-deprecated").
     done successfully.
    
    
    
     Executing test function test.set_tclass_changes_index_tclass ... done successfully.
    
    
    
     Executing test function test.set_tclass_drops_xts_tclass_indexCLASS ... done successfully.
    
    
    
     Executing test function test.set_xtsAttributes_removes_tclass_indexClass ... done successfully.
    
    
    
     Executing test function test.get_coredata_drops_xts_indexFORMAT ... done successfully.
    
    
    
     Executing test function test.get_indexFORMAT_warns ... Error : (converted from warning) 'indexFormat' is deprecated.
     Use 'tformat' instead.
     See help("Deprecated") and help("xts-deprecated").
     In addition: Warning messages:
     1: In RNGkind(kind = testSuite$rngKind, normal.kind = testSuite$rngNormalKind) :
     RNGkind: Marsaglia-Multicarry has poor statistical properties
     2: In RNGkind(kind = testSuite$rngKind, normal.kind = testSuite$rngNormalKind) :
     RNGkind: severe deviations from normality for Kinderman-Ramage + Marsaglia-Multicarry
     done successfully.
    
    
    
     Executing test function test.get_tformat ... done successfully.
    
    
    
     Executing test function test.get_xtsAttributes_excludes_indexFORMAT ... done successfully.
    
    
    
     Executing test function test.set_indexFORMAT_warns ... Error : (converted from warning) 'indexFormat<-' is deprecated.
     Use 'tformat<-' instead.
     See help("Deprecated") and help("xts-deprecated").
     done successfully.
    
    
    
     Executing test function test.set_tformat_changes_index_tformat ... done successfully.
    
    
    
     Executing test function test.set_tformat_drops_xts_indexFORMAT ... done successfully.
    
    
    
     Executing test function test.set_xtsAttributes_removes_indexFORMAT ... done successfully.
    
    
    
     Executing test function test.tbs_199901_to_200801_by_month ... done successfully.
    
    
    
     Executing test function test.tbs_199901_to_200801_by_month_Date ... done successfully.
    
    
    
     Executing test function test.tbs_199901_to_200801_by_month_POSIXct ... done successfully.
    
    
    
     Executing test function test.tbs_199901_to_2008_by_month ... done successfully.
    
    
    
     Executing test function test.tbs_199901_to_2008_by_month_Date ... done successfully.
    
    
    
     Executing test function test.tbs_199901_to_2008_by_month_POSIXct ... done successfully.
    
    
    
     Executing test function test.tbs_1999_to_200801_by_month ... done successfully.
    
    
    
     Executing test function test.tbs_1999_to_200801_by_month_Date ... done successfully.
    
    
    
     Executing test function test.tbs_1999_to_200801_by_month_POSIXct ... done successfully.
    
    
    
     Executing test function test.tbs_1999_to_2008_by_year ... done successfully.
    
    
    
     Executing test function test.tbs_1999_to_2008_by_year_Date ... done successfully.
    
    
    
     Executing test function test.tbs_1999_to_2008_by_year_retclassDate ... done successfully.
    
    
    
     Executing test function test.convert_timeSeries.univariate_to_xts ... done successfully.
    
    
    
     Executing test function test.convert_timeSeries.univariate_to_xts_i1 ... done successfully.
    
    
    
     Executing test function test.convert_timeSeries.univariate_to_xts_i1j1 ... done successfully.
    
    
    
     Executing test function test.convert_timeSeries.univariate_to_xts_j1 ... done successfully.
    
    
    
     Executing test function test.convert_timeSeries_to_xts ... done successfully.
    
    
    
     Executing test function test.convert_timeSeries_to_xts_i1 ... done successfully.
    
    
    
     Executing test function test.convert_timeSeries_to_xts_i1j1 ... done successfully.
    
    
    
     Executing test function test.convert_timeSeries_to_xts_j1 ... done successfully.
    
    
    
     Executing test function test.timeSeries_reclass ... done successfully.
    
    
    
     Executing test function test.timeSeries_reclass_subset_as.xts_j1 ... done successfully.
    
    
    
     Executing test function test.timeSeries_reclass_subset_reclass_j1 ... done successfully.
    
    
    
     Executing test function test.timeSeries_reclass_subset_timeSeries_j1 ... done successfully.
    
    
    
     Executing test function test.to.frequency_includes_first_group ... done successfully.
    
    
    
     Executing test function test.convert_ts12_to_xts ... done successfully.
    
    
    
     Executing test function test.convert_ts12_to_xts_i1 ... done successfully.
    
    
    
     Executing test function test.convert_ts12_to_xts_i1j1 ... done successfully.
    
    
    
     Executing test function test.convert_ts12_to_xts_j1 ... done successfully.
    
    
    
     Executing test function test.convert_ts4_to_xts ... done successfully.
    
    
    
     Executing test function test.convert_ts4_to_xts_i1 ... done successfully.
    
    
    
     Executing test function test.convert_ts4_to_xts_i1j1 ... done successfully.
    
    
    
     Executing test function test.convert_ts4_to_xts_j1 ... done successfully.
    
    
    
     Executing test function test.convert_ts_to_xts ... done successfully.
    
    
    
     Executing test function test.convert_ts_to_xts_i1 ... done successfully.
    
    
    
     Executing test function test.convert_ts_to_xts_i1j1 ... done successfully.
    
    
    
     Executing test function test.convert_ts_to_xts_j1 ... done successfully.
    
    
    
     Executing test function test.ts12_reclass ... done successfully.
    
    
    
     Executing test function test.ts12_reclass_subset_as.xts_j1 ... done successfully.
    
    
    
     Executing test function test.ts12_reclass_subset_reclass_j1 ... done successfully.
    
    
    
     Executing test function test.ts12_reclass_subset_ts_j1 ... done successfully.
    
    
    
     Executing test function test.ts4_reclass ... done successfully.
    
    
    
     Executing test function test.ts4_reclass_subset_as.xts_j1 ... done successfully.
    
    
    
     Executing test function test.ts4_reclass_subset_reclass_j1 ... done successfully.
    
    
    
     Executing test function test.ts4_reclass_subset_ts_j1 ... done successfully.
    
    
    
     Executing test function test.ts_reclass ... done successfully.
    
    
    
     Executing test function test.ts_reclass_subset_as.xts_j1 ... done successfully.
    
    
    
     Executing test function test.ts_reclass_subset_reclass_j1 ... done successfully.
    
    
    
     Executing test function test.ts_reclass_subset_ts_j1 ... done successfully.
    
    
    
     Executing test function test.get_coredata_drops_xts_tzone_indexTZ ... done successfully.
    
    
    
     Executing test function test.get_indexTZ_warns ... Error : (converted from warning) 'indexTZ' is deprecated.
     Use 'tzone' instead.
     See help("Deprecated") and help("xts-deprecated").
     In addition: Warning messages:
     1: In RNGkind(kind = testSuite$rngKind, normal.kind = testSuite$rngNormalKind) :
     RNGkind: Marsaglia-Multicarry has poor statistical properties
     2: In RNGkind(kind = testSuite$rngKind, normal.kind = testSuite$rngNormalKind) :
     RNGkind: severe deviations from normality for Kinderman-Ramage + Marsaglia-Multicarry
     3: In RNGkind(kind = testSuite$rngKind, normal.kind = testSuite$rngNormalKind) :
     RNGkind: Marsaglia-Multicarry has poor statistical properties
     4: In RNGkind(kind = testSuite$rngKind, normal.kind = testSuite$rngNormalKind) :
     RNGkind: severe deviations from normality for Kinderman-Ramage + Marsaglia-Multicarry
     5: In RNGkind(kind = testSuite$rngKind, normal.kind = testSuite$rngNormalKind) :
     RNGkind: Marsaglia-Multicarry has poor statistical properties
     6: In RNGkind(kind = testSuite$rngKind, normal.kind = testSuite$rngNormalKind) :
     RNGkind: severe deviations from normality for Kinderman-Ramage + Marsaglia-Multicarry
     7: In RNGkind(kind = testSuite$rngKind, normal.kind = testSuite$rngNormalKind) :
     RNGkind: Marsaglia-Multicarry has poor statistical properties
     8: In RNGkind(kind = testSuite$rngKind, normal.kind = testSuite$rngNormalKind) :
     RNGkind: severe deviations from normality for Kinderman-Ramage + Marsaglia-Multicarry
     9: In RNGkind(kind = testSuite$rngKind, normal.kind = testSuite$rngNormalKind) :
     RNGkind: Marsaglia-Multicarry has poor statistical properties
     10: In RNGkind(kind = testSuite$rngKind, normal.kind = testSuite$rngNormalKind) :
     RNGkind: severe deviations from normality for Kinderman-Ramage + Marsaglia-Multicarry
     done successfully.
    
    
    
     Executing test function test.get_tzone ... done successfully.
    
    
    
     Executing test function test.get_xtsAttributes_excludes_tzone_indexTZ ... done successfully.
    
    
    
     Executing test function test.set_indexTZ_warns ... Error : (converted from warning) 'indexTZ<-' is deprecated.
     Use 'tzone<-' instead.
     See help("Deprecated") and help("xts-deprecated").
     done successfully.
    
    
    
     Executing test function test.set_tzone_changes_index_tzone ... done successfully.
    
    
    
     Executing test function test.set_tzone_drops_xts_tzone_indexTZ ... done successfully.
    
    
    
     Executing test function test.set_tzone_to_NULL_sets_empty_string ... done successfully.
    
    
    
     Executing test function test.set_xtsAttributes_removes_tzone_indexTZ ... done successfully.
    
    
    
     Executing test function test..xts_ctor_does_not_return_rownames ... done successfully.
    
    
    
     Executing test function test..xts_dimnames_in_dots ... done successfully.
    
    
    
     Executing test function test..xts_index_class_precedence ... done successfully.
    
    
    
     Executing test function test..xts_index_format_precedence ... done successfully.
    
    
    
     Executing test function test..xts_index_tzone_precedence ... done successfully.
    
    
    
     Executing test function test..xts_order.by_Inf_double ... Error in .xts(1:3, c(1, 2, Inf)) :
     'index' cannot contain 'NA', 'NaN', or 'Inf'
     In addition: There were 14 warnings (use warnings() to see them)
     Error in .xts(1:3, c(-Inf, 2, 3)) :
     'index' cannot contain 'NA', 'NaN', or 'Inf'
     done successfully.
    
    
    
     Executing test function test..xts_order.by_NA_double ... Error in .xts(1:3, c(1, 2, NA)) :
     'index' cannot contain 'NA', 'NaN', or 'Inf'
     Error in .xts(1:3, c(NA, 2, 3)) :
     'index' cannot contain 'NA', 'NaN', or 'Inf'
     Error in .xts(1:3, c(1, NA, 3)) :
     'index' cannot contain 'NA', 'NaN', or 'Inf'
     done successfully.
    
    
    
     Executing test function test..xts_order.by_NA_integer ... Error in .xts(1:3, c(1L, 2L, NA)) :
     'index' cannot contain 'NA', 'NaN', or 'Inf'
     Error in .xts(1:3, c(NA, 2L, 3L)) : index is not in increasing order
     Error in .xts(1:3, c(1L, NA, 3L)) : index is not in increasing order
     done successfully.
    
    
    
     Executing test function test..xts_order.by_NaN_double ... Error in .xts(1:3, c(1, 2, NaN)) :
     'index' cannot contain 'NA', 'NaN', or 'Inf'
     Error in .xts(1:3, c(NaN, 2, 3)) :
     'index' cannot contain 'NA', 'NaN', or 'Inf'
     Error in .xts(1:3, c(1, NaN, 3)) :
     'index' cannot contain 'NA', 'NaN', or 'Inf'
     done successfully.
    
    
    
     Executing test function test..xts_user_attributes ... done successfully.
    
    
    
     Executing test function test.ctors_dont_add_indexFORMAT_to_object ... done successfully.
    
    
    
     Executing test function test.ctors_dont_add_tclass_indexCLASS_to_object ... done successfully.
    
    
    
     Executing test function test.ctors_dont_add_tzone_indexTZ_to_object ... done successfully.
    
    
    
     Executing test function test.xts_ctor_warns_for_indexCLASS_arg ... Error in xts(1, as.Date("2018-05-02"), .indexCLASS = "Date") :
     (converted from warning) '.indexCLASS' is deprecated, use tclass instead.
     In addition: Warning messages:
     1: In .xts(1, 1, tformat = "%Y", .indexCLASS = "Date", .indexTZ = "UTC", :
     '.indexCLASS' is deprecated, use tclass instead.
     2: In .xts(1, 1, tformat = "%Y", .indexCLASS = "Date", .indexTZ = "UTC", :
     '.indexTZ' is deprecated and will be ignored, use tzone instead.
     Error in .xts(1, as.Date("2018-05-02"), .indexCLASS = "Date") :
     (converted from warning) '.indexCLASS' is deprecated, use tclass instead.
     done successfully.
    
    
    
     Executing test function test.xts_ctor_warns_for_indexFORMAT_arg ... Error in xts(1, as.Date("2018-05-02"), .indexFORMAT = "%Y") :
     (converted from warning) '.indexFORMAT' is deprecated, use tformat instead.
     Error in .xts(1, as.Date("2018-05-02"), .indexFORMAT = "%Y") :
     (converted from warning) '.indexFORMAT' is deprecated, use tformat instead.
     done successfully.
    
    
    
     Executing test function test.xts_ctor_warns_for_indexTZ_arg ... Error in xts(1, as.Date("2018-05-02"), .indexTZ = "UTC") :
     (converted from warning) '.indexTZ' is deprecated, use tzone instead.
     Error in .xts(1, as.Date("2018-05-02"), .indexTZ = "UTC") :
     (converted from warning) '.indexTZ' is deprecated and will be ignored, use tzone instead.
     done successfully.
    
    
    
     Executing test function test.xts_no_args_has_index_with_tzone_tclass ... done successfully.
    
    
    
     Executing test function test.xts_only_use_first_tzone_element ... done successfully.
    
    
    
     Executing test function test.xts_order.by_Inf_double ... Error in xts(1:3, .POSIXct(c(1, 2, Inf))) :
     'order.by' cannot contain 'NA', 'NaN', or 'Inf'
     Error in xts(1:3, .POSIXct(c(-Inf, 2, 3))) :
     'order.by' cannot contain 'NA', 'NaN', or 'Inf'
     done successfully.
    
    
    
     Executing test function test.xts_order.by_NA_double ... Error in xts(1:3, .POSIXct(c(1, 2, NA))) :
     'order.by' cannot contain 'NA', 'NaN', or 'Inf'
     Error in xts(1:3, .POSIXct(c(NA, 2, 3))) :
     'order.by' cannot contain 'NA', 'NaN', or 'Inf'
     Error in xts(1:3, .POSIXct(c(1, NA, 3))) :
     'order.by' cannot contain 'NA', 'NaN', or 'Inf'
     done successfully.
    
    
    
     Executing test function test.xts_order.by_NA_integer ... Error in xts(1:3, as.Date(c(1L, 2L, NA), origin = "1970-01-01")) :
     'order.by' cannot contain 'NA', 'NaN', or 'Inf'
     Error in xts(1:3, as.Date(c(NA, 2L, 3L), origin = "1970-01-01")) :
     'order.by' cannot contain 'NA', 'NaN', or 'Inf'
     Error in xts(1:3, as.Date(c(1L, NA, 3L), origin = "1970-01-01")) :
     'order.by' cannot contain 'NA', 'NaN', or 'Inf'
     done successfully.
    
    
    
     Executing test function test.xts_order.by_NaN_double ... Error in xts(1:3, .POSIXct(c(1, 2, NaN))) :
     'order.by' cannot contain 'NA', 'NaN', or 'Inf'
     Error in xts(1:3, .POSIXct(c(NaN, 2, 3))) :
     'order.by' cannot contain 'NA', 'NaN', or 'Inf'
     Error in xts(1:3, .POSIXct(c(1, NaN, 3))) :
     'order.by' cannot contain 'NA', 'NaN', or 'Inf'
     done successfully.
    
    
    
     Executing test function test.as.Date.numeric ... done successfully.
    
    
    
     Executing test function test.rbind_zero_length_non_zero_length_Date_errors ... done successfully.
    
    
    
     Executing test function test.rbind_zero_length_non_zero_length_POSIXct_errors ... done successfully.
    
    
    
     Executing test function test.subset_i_ISO8601 ... done successfully.
    
    
    
     Executing test function test.subset_i_datetime_or_character ... done successfully.
    
    
    
     Executing test function test.window ... Timing stopped at: 0.003 0 0.002
     Error in checkIdentical(bin, reg, "Range over gap") : FALSE
     Range over gap
     In addition: Warning messages:
     1: In RNGkind(kind = testSuite$rngKind, normal.kind = testSuite$rngNormalKind) :
     RNGkind: Marsaglia-Multicarry has poor statistical properties
     2: In RNGkind(kind = testSuite$rngKind, normal.kind = testSuite$rngNormalKind) :
     RNGkind: severe deviations from normality for Kinderman-Ramage + Marsaglia-Multicarry
     done successfully.
    
    
    
     Executing test function test.convert_zoo_to_xts ... done successfully.
    
    
    
     Executing test function test.convert_zoo_to_xts_i1 ... done successfully.
    
    
    
     Executing test function test.convert_zoo_to_xts_i1j1 ... done successfully.
    
    
    
     Executing test function test.convert_zoo_to_xts_j1 ... done successfully.
    
    
    
     Executing test function test.zoo_reclass_subset_as.xts_j1 ... done successfully.
    
    
    
     Executing test function test.zoo_reclass_subset_zoo_j1 ... done successfully.
    
     ------------------- UNIT TEST SUMMARY ---------------------
    
     RUNIT TEST PROTOCOL -- Mon Sep 20 03:57:21 2021
     ***********************************************
     Number of test functions: 432
     Number of errors: 0
     Number of failures: 1
    
    
     1 Test Suite :
     xts unit testing - 432 test functions, 0 errors, 1 failure
     FAILURE in test.window: Error in checkIdentical(bin, reg, "Range over gap") : FALSE
     Range over gap
     Error:
    
     unit testing failed (#test failures: 1, #R errors: 0)
    
     In addition: Warning messages:
     1: In RNGkind(kind = testSuite$rngKind, normal.kind = testSuite$rngNormalKind) :
     RNGkind: Marsaglia-Multicarry has poor statistical properties
     2: In RNGkind(kind = testSuite$rngKind, normal.kind = testSuite$rngNormalKind) :
     RNGkind: severe deviations from normality for Kinderman-Ramage + Marsaglia-Multicarry
     Execution halted
Flavor: r-devel-linux-x86_64-fedora-gcc

Version: 0.12.1
Check: tests
Result: ERROR
     Running 'doRUnit.R' [10s]
    Running the tests in 'tests/doRUnit.R' failed.
    Complete output:
     > ## unit tests will not be done if RUnit is not available
     > if(require("RUnit", quietly=TRUE)) {
     +
     + ## --- Setup ---
     + R_CMD_CHECK <- Sys.getenv("RCMDCHECK") != "FALSE"
     +
     + pkg <- "xts" # <-- Change to package name!
     + if (R_CMD_CHECK) {
     + ## Path to unit tests for R CMD check
     + ## PKG.Rcheck/tests/../PKG/unitTests
     + path <- system.file(package=pkg, "unitTests")
     + } else {
     + ## Path to unit tests for standalone running under Makefile (not R CMD check)
     + ## PKG/tests/../inst/unitTests
     + path <- file.path(getwd(), "..", "inst", "unitTests")
     + }
     + cat("\nRunning unit tests\n")
     + print(list(pkg=pkg, getwd=getwd(), pathToUnitTests=path))
     +
     + library(package=pkg, character.only=TRUE)
     +
     + ## If desired, load the name space to allow testing of private functions
     + ## if (is.element(pkg, loadedNamespaces()))
     + ## attach(loadNamespace(pkg), name=paste("namespace", pkg, sep=":"), pos=3)
     + ##
     + ## or simply call PKG:::myPrivateFunction() in tests
     +
     + ## --- Testing ---
     +
     + ## Define tests
     + testSuite <- defineTestSuite(name=paste(pkg, "unit testing"),
     + dirs=path)
     + ## Run
     + tests <- runTestSuite(testSuite)
     +
     + ## Report to stdout
     + cat("------------------- UNIT TEST SUMMARY ---------------------\n\n")
     + printTextProtocol(tests, showDetails=FALSE)
     +
     + ## Report text files (only if not under R CMD check)
     + if (!R_CMD_CHECK) {
     + ## Default report name
     + pathReport <- file.path(path, "report")
     +
     + printTextProtocol(tests, showDetails=FALSE,
     + fileName=paste(pathReport, "Summary.txt", sep=""))
     + printTextProtocol(tests, showDetails=TRUE,
     + fileName=paste(pathReport, ".txt", sep=""))
     +
     + ## Report to HTML file
     + printHTMLProtocol(tests, fileName=paste(pathReport, ".html", sep=""))
     + }
     +
     + ## Return stop() to cause R CMD check stop in case of
     + ## - failures i.e. FALSE to unit tests or
     + ## - errors i.e. R errors
     + tmp <- getErrors(tests)
     + if(tmp$nFail > 0 | tmp$nErr > 0) {
     + stop(paste("\n\nunit testing failed (#test failures: ", tmp$nFail,
     + ", #R errors: ", tmp$nErr, ")\n\n", sep=""))
     + }
     + } else {
     + warning("cannot run unit tests -- package RUnit is not available")
     + }
    
     Running unit tests
     $pkg
     [1] "xts"
    
     $getwd
     [1] "d:/Rcompile/CRANpkg/local/4.2/xts.Rcheck/tests"
    
     $pathToUnitTests
     [1] "D:/temp/RtmpAttuuA/RLIBS_183a01f423c0c/xts/unitTests"
    
     Loading required package: zoo
    
     Attaching package: 'zoo'
    
     The following objects are masked from 'package:base':
    
     as.Date, as.Date.numeric
    
    
    
     Executing test function test.get_tclass_POSIXct_ts2 ... done successfully.
    
    
    
     Executing test function test.get_tclass_ts1 ... done successfully.
    
    
    
     Executing test function test.get_tzone_ts2 ... done successfully.
    
    
    
     Executing test function test.ops_xts1d_matrix1d_dimnames ... done successfully.
    
    
    
     Executing test function test.ops_xts1d_matrix1d_no_dimnames ... done successfully.
    
    
    
     Executing test function test.ops_xts1d_matrix1d_only_colnames ... done successfully.
    
    
    
     Executing test function test.ops_xts1d_matrix1d_only_rownames ... done successfully.
    
    
    
     Executing test function test.ops_xts1d_vector_names ... done successfully.
    
    
    
     Executing test function test.ops_xts1d_vector_no_names ... done successfully.
    
    
    
     Executing test function test.ops_xts1d_xts1d ... done successfully.
    
    
    
     Executing test function test.ops_xts1d_xts1d_different_index ... done successfully.
    
    
    
     Executing test function test.ops_xts2d_matrix2d_dimnames ... done successfully.
    
    
    
     Executing test function test.ops_xts2d_matrix2d_no_dimnames ... done successfully.
    
    
    
     Executing test function test.ops_xts2d_matrix2d_only_colnames ... done successfully.
    
    
    
     Executing test function test.ops_xts2d_matrix2d_only_rownames ... done successfully.
    
    
    
     Executing test function test.ops_xts2d_vector_names ... done successfully.
    
    
    
     Executing test function test.ops_xts2d_vector_no_names ... done successfully.
    
    
    
     Executing test function test.ops_xts_no_dim_matrix1d ... done successfully.
    
    
    
     Executing test function test.ops_xts_no_dim_matrix2d ... done successfully.
    
    
    
     Executing test function test.ops_xts_no_dim_vector ... done successfully.
    
    
    
     Executing test function test.tclass_POSIXct_after_rel_op ... done successfully.
    
    
    
     Executing test function test.tclass_after_rel_op ... done successfully.
    
    
    
     Executing test function test.tzone_after_rel_op ... done successfully.
    
    
    
     Executing test function test.make.index.unique_1us_default_eps ... done successfully.
    
    
    
     Executing test function test.make.index.unique_adds_eps_to_duplicates ... done successfully.
    
    
    
     Executing test function test.make.index.unique_converts_date_index_to_POSIXct ... done successfully.
    
    
    
     Executing test function test.make.index.unique_no_warn_if_unique_timestamps_unchanged ... done successfully.
    
    
    
     Executing test function test.make.index.unique_returns_sorted_index ... done successfully.
    
    
    
     Executing test function test.make.index.unique_warns_ONCE_if_unique_timestamp_changes ... done successfully.
    
    
    
     Executing test function test.make.index.unique_warns_if_unique_timestamp_changes ... Error in make.index.unique.xts(x, eps = eps) :
     (converted from warning) index value is unique but will be replaced; it is less than the cumulative epsilon for the preceding duplicate index values
     In addition: Warning messages:
     1: In RNGkind(kind = testSuite$rngKind, normal.kind = testSuite$rngNormalKind) :
     RNGkind: Marsaglia-Multicarry has poor statistical properties
     2: In RNGkind(kind = testSuite$rngKind, normal.kind = testSuite$rngNormalKind) :
     RNGkind: severe deviations from normality for Kinderman-Ramage + Marsaglia-Multicarry
     3: In RNGkind(kind = testSuite$rngKind, normal.kind = testSuite$rngNormalKind) :
     RNGkind: Marsaglia-Multicarry has poor statistical properties
     4: In RNGkind(kind = testSuite$rngKind, normal.kind = testSuite$rngNormalKind) :
     RNGkind: severe deviations from normality for Kinderman-Ramage + Marsaglia-Multicarry
     5: In make.index.unique.xts(x, eps = 1e-06) :
     index value is unique but will be replaced; it is less than the cumulative epsilon for the preceding duplicate index values
     6: In make.index.unique.xts(x, eps = eps) :
     index value is unique but will be replaced; it is less than the cumulative epsilon for the preceding duplicate index values
     done successfully.
    
    
    
     Executing test function test.attr_on_object_equal_to_attr_on_index ... done successfully.
    
    
    
     Executing test function test.double_with_small_delta_stops ... done successfully.
    
    
    
     Executing test function test.find_first_zero_even_length ... done successfully.
    
    
    
     Executing test function test.find_first_zero_odd_length ... done successfully.
    
    
    
     Executing test function test.find_last_zero_even_length ... done successfully.
    
    
    
     Executing test function test.find_last_zero_odd_length ... done successfully.
    
    
    
     Executing test function test.integer_predicate_no_yes_stops ... done successfully.
    
    
    
     Executing test function test.key_greater_than_max ... done successfully.
    
    
    
     Executing test function test.key_is_NA ... done successfully.
    
    
    
     Executing test function test.key_is_zero_length ... done successfully.
    
    
    
     Executing test function test.key_less_than_min ... done successfully.
    
    
    
     Executing test function test.vec_is_zero_length ... done successfully.
    
    
    
     Executing test function test.coredata_data.frame ... done successfully.
    
    
    
     Executing test function test.coredata_empty ... done successfully.
    
    
    
     Executing test function test.coredata_empty_dim ... done successfully.
    
    
    
     Executing test function test.coredata_empty_dim_dimnames ... done successfully.
    
    
    
     Executing test function test.coredata_matrix ... done successfully.
    
    
    
     Executing test function test.coredata_named_matrix ... done successfully.
    
    
    
     Executing test function test.coredata_named_vector ... done successfully.
    
    
    
     Executing test function test.coredata_ts ... done successfully.
    
    
    
     Executing test function test.coredata_vector ... done successfully.
    
    
    
     Executing test function test.convert_data.frame_to_xts ... done successfully.
    
    
    
     Executing test function test.convert_data.frame_to_xts_i1 ... done successfully.
    
    
    
     Executing test function test.convert_data.frame_to_xts_i1j1 ... done successfully.
    
    
    
     Executing test function test.convert_data.frame_to_xts_j1 ... done successfully.
    
    
    
     Executing test function test.convert_data.frame_to_xts_order.by_Date ... done successfully.
    
    
    
     Executing test function test.convert_data.frame_to_xts_order.by_POSIXct ... done successfully.
    
    
    
     Executing test function test.convert_data.frame_to_xts_order.by_POSIXlt ... done successfully.
    
    
    
     Executing test function test.data.frame_reclass ... done successfully.
    
    
    
     Executing test function test.data.frame_reclass_subset_as.xts_j1 ... done successfully.
    
    
    
     Executing test function test.data.frame_reclass_subset_data.frame_j1 ... Error in try.xts(sample.data.frame[, 1]) :
     Error in as.xts.double(x, ..., .RECLASS = TRUE) : order.by must be either 'names()' or otherwise specified
     In addition: Warning messages:
     1: In RNGkind(kind = testSuite$rngKind, normal.kind = testSuite$rngNormalKind) :
     RNGkind: Marsaglia-Multicarry has poor statistical properties
     2: In RNGkind(kind = testSuite$rngKind, normal.kind = testSuite$rngNormalKind) :
     RNGkind: severe deviations from normality for Kinderman-Ramage + Marsaglia-Multicarry
     3: In RNGkind(kind = testSuite$rngKind, normal.kind = testSuite$rngNormalKind) :
     RNGkind: Marsaglia-Multicarry has poor statistical properties
     4: In RNGkind(kind = testSuite$rngKind, normal.kind = testSuite$rngNormalKind) :
     RNGkind: severe deviations from normality for Kinderman-Ramage + Marsaglia-Multicarry
     5: In RNGkind(kind = testSuite$rngKind, normal.kind = testSuite$rngNormalKind) :
     RNGkind: Marsaglia-Multicarry has poor statistical properties
     6: In RNGkind(kind = testSuite$rngKind, normal.kind = testSuite$rngNormalKind) :
     RNGkind: severe deviations from normality for Kinderman-Ramage + Marsaglia-Multicarry
     7: In RNGkind(kind = testSuite$rngKind, normal.kind = testSuite$rngNormalKind) :
     RNGkind: Marsaglia-Multicarry has poor statistical properties
     8: In RNGkind(kind = testSuite$rngKind, normal.kind = testSuite$rngNormalKind) :
     RNGkind: severe deviations from normality for Kinderman-Ramage + Marsaglia-Multicarry
     done successfully.
    
    
    
     Executing test function test.data.frame_reclass_subset_reclass_j1 ... done successfully.
    
    
    
     Executing test function test.diff_differences_LT1 ... Error in diff.xts(x, 1L, -1L) :
     'diff.xts' defined only for positive lag and differences arguments
     In addition: Warning messages:
     1: In RNGkind(kind = testSuite$rngKind, normal.kind = testSuite$rngNormalKind) :
     RNGkind: Marsaglia-Multicarry has poor statistical properties
     2: In RNGkind(kind = testSuite$rngKind, normal.kind = testSuite$rngNormalKind) :
     RNGkind: severe deviations from normality for Kinderman-Ramage + Marsaglia-Multicarry
     done successfully.
    
    
    
     Executing test function test.diff_differences_NA ... Error in diff.xts(x, 1L, "a") : 'differences' must be integer
     In addition: Warning message:
     In diff.xts(x, 1L, "a") : NAs introduced by coercion
     done successfully.
    
    
    
     Executing test function test.diff_integer_Date ... done successfully.
    
    
    
     Executing test function test.diff_integer_POSIXt ... done successfully.
    
    
    
     Executing test function test.diff_lag_LT1 ... Error in diff.xts(x, -1L, 1L) :
     'diff.xts' defined only for positive lag and differences arguments
     done successfully.
    
    
    
     Executing test function test.diff_lag_NA ... Error in diff.xts(x, "a", 1L) : 'lag' must be integer
     In addition: Warning message:
     In diff.xts(x, "a", 1L) : NAs introduced by coercion
     done successfully.
    
    
    
     Executing test function test.diff_logical_Date ... done successfully.
    
    
    
     Executing test function test.diff_logical_POSIXt ... done successfully.
    
    
    
     Executing test function test.diff_logical_preserves_colnames ... done successfully.
    
    
    
     Executing test function test.diff_numeric_Date ... done successfully.
    
    
    
     Executing test function test.diff_numeric_POSIXt ... done successfully.
    
    
    
     Executing test function test.days_double_index ... done successfully.
    
    
    
     Executing test function test.days_integer_index ... done successfully.
    
    
    
     Executing test function test.double_index_cross_epoch ... done successfully.
    
    
    
     Executing test function test.hours_double_index ... done successfully.
    
    
    
     Executing test function test.hours_integer_index ... done successfully.
    
    
    
     Executing test function test.integer_index_cross_epoch ... done successfully.
    
    
    
     Executing test function test.minutes_double_index ... done successfully.
    
    
    
     Executing test function test.minutes_integer_index ... done successfully.
    
    
    
     Executing test function test.minutes_mins ... done successfully.
    
    
    
     Executing test function test.months_double_index ... done successfully.
    
    
    
     Executing test function test.months_integer_index ... done successfully.
    
    
    
     Executing test function test.multiple_quarters ... done successfully.
    
    
    
     Executing test function test.quarters_double_index ... done successfully.
    
    
    
     Executing test function test.quarters_integer_index ... done successfully.
    
    
    
     Executing test function test.seconds_double_index ... done successfully.
    
    
    
     Executing test function test.seconds_integer_index ... done successfully.
    
    
    
     Executing test function test.seconds_secs ... done successfully.
    
    
    
     Executing test function test.sparse_days ... done successfully.
    
    
    
     Executing test function test.sparse_months ... done successfully.
    
    
    
     Executing test function test.sparse_quarters ... done successfully.
    
    
    
     Executing test function test.sparse_weeks ... done successfully.
    
    
    
     Executing test function test.sparse_years ... done successfully.
    
    
    
     Executing test function test.sub_second_resolution ... done successfully.
    
    
    
     Executing test function test.sub_second_resolution_exact ... done successfully.
    
    
    
     Executing test function test.sub_second_resolution_representation ... done successfully.
    
    
    
     Executing test function test.weeks_double_index ... done successfully.
    
    
    
     Executing test function test.weeks_integer_index ... done successfully.
    
    
    
     Executing test function test.years_double_index ... done successfully.
    
    
    
     Executing test function test.years_integer_index ... done successfully.
    
    
    
     Executing test function test.first_nonxtsible_data.frame_neg_n ... done successfully.
    
    
    
     Executing test function test.first_nonxtsible_data.frame_pos_n ... done successfully.
    
    
    
     Executing test function test.first_nonxtsible_matrix_neg_n ... done successfully.
    
    
    
     Executing test function test.first_nonxtsible_matrix_pos_n ... done successfully.
    
    
    
     Executing test function test.first_nonxtsible_vector ... done successfully.
    
    
    
     Executing test function test.first_xtsible_data.frame_neg_n ... done successfully.
    
    
    
     Executing test function test.first_xtsible_data.frame_pos_n ... done successfully.
    
    
    
     Executing test function test.first_xtsible_matrix_neg_n ... done successfully.
    
    
    
     Executing test function test.first_xtsible_matrix_pos_n ... done successfully.
    
    
    
     Executing test function test.first_xtsible_vector ... done successfully.
    
    
    
     Executing test function test.first_zoo_neg_n ... done successfully.
    
    
    
     Executing test function test.first_zoo_pos_n ... done successfully.
    
    
    
     Executing test function test.last_nonxtsible_data.frame_neg_n ... done successfully.
    
    
    
     Executing test function test.last_nonxtsible_data.frame_pos_n ... done successfully.
    
    
    
     Executing test function test.last_nonxtsible_matrix_neg_n ... done successfully.
    
    
    
     Executing test function test.last_nonxtsible_matrix_pos_n ... done successfully.
    
    
    
     Executing test function test.last_nonxtsible_vector ... done successfully.
    
    
    
     Executing test function test.last_xtsible_data.frame_neg_n ... done successfully.
    
    
    
     Executing test function test.last_xtsible_data.frame_pos_n ... done successfully.
    
    
    
     Executing test function test.last_xtsible_matrix_neg_n ... done successfully.
    
    
    
     Executing test function test.last_xtsible_matrix_pos_n ... done successfully.
    
    
    
     Executing test function test.last_xtsible_vector ... done successfully.
    
    
    
     Executing test function test.last_zoo_neg_n ... done successfully.
    
    
    
     Executing test function test.last_zoo_pos_n ... done successfully.
    
    
    
     Executing test function test.zero_length_vector ... done successfully.
    
    
    
     Executing test function test.zero_row_matrix ... done successfully.
    
    
    
     Executing test function test.convert_fts12_to_xts ... done successfully.
    
    
    
     Executing test function test.convert_fts12_to_xts_i1 ... done successfully.
    
    
    
     Executing test function test.convert_fts12_to_xts_i1j1 ... done successfully.
    
    
    
     Executing test function test.convert_fts12_to_xts_j1 ... done successfully.
    
    
    
     Executing test function test.convert_fts4_to_xts ... done successfully.
    
    
    
     Executing test function test.convert_fts4_to_xts_i1 ... done successfully.
    
    
    
     Executing test function test.convert_fts4_to_xts_i1j1 ... done successfully.
    
    
    
     Executing test function test.convert_fts4_to_xts_j1 ... done successfully.
    
    
    
     Executing test function test.convert_fts_to_xts ... done successfully.
    
    
    
     Executing test function test.convert_fts_to_xts_i1 ... done successfully.
    
    
    
     Executing test function test.convert_fts_to_xts_i1j1 ... done successfully.
    
    
    
     Executing test function test.convert_fts_to_xts_j1 ... done successfully.
    
    
    
     Executing test function test.fts12_reclass ... done successfully.
    
    
    
     Executing test function test.fts12_reclass_subset_as.xfts_j1 ... done successfully.
    
    
    
     Executing test function test.fts12_reclass_subset_fts_j1 ... done successfully.
    
    
    
     Executing test function test.fts12_reclass_subset_reclass_j1 ... done successfully.
    
    
    
     Executing test function test.fts4_reclass ... done successfully.
    
    
    
     Executing test function test.fts4_reclass_subset_as.xts_j1 ... done successfully.
    
    
    
     Executing test function test.fts4_reclass_subset_fts_j1 ... done successfully.
    
    
    
     Executing test function test.fts4_reclass_subset_reclass_j1 ... done successfully.
    
    
    
     Executing test function test.fts_reclass ... done successfully.
    
    
    
     Executing test function test.fts_reclass_subset_as.xts_j1 ... done successfully.
    
    
    
     Executing test function test.fts_reclass_subset_fts_j1 ... done successfully.
    
    
    
     Executing test function test.fts_reclass_subset_reclass_j1 ... done successfully.
    
    
    
     Executing test function test.get_index_does_not_error_if_index_has_no_attributes ... done successfully.
    
    
    
     Executing test function test.set_.index_copies_index_attributes ... done successfully.
    
    
    
     Executing test function test.set_index_copies_index_attributes ... done successfully.
    
    
    
     Executing test function test.set_index_restores_tzone_attribute ... done successfully.
    
    
    
     Executing test function test.checkUTC_set_index2Date ... done successfully.
    
    
    
     Executing test function test.checkUTC_set_index2chron ... done successfully.
    
    
    
     Executing test function test.checkUTC_set_index2yearmon ... done successfully.
    
    
    
     Executing test function test.checkUTC_set_index2yearqtr ... done successfully.
    
    
    
     Executing test function test.convert_Date2Date ... done successfully.
    
    
    
     Executing test function test.convert_Date2POSIXct ... done successfully.
    
    
    
     Executing test function test.convert_Date2chron ... done successfully.
    
    
    
     Executing test function test.convert_Date2timeDate ... done successfully.
    
    
    
     Executing test function test.convert_Date2yearmon ... done successfully.
    
    
    
     Executing test function test.convert_Date2yearqtr ... done successfully.
    
    
    
     Executing test function test.convert_POSIXct2Date ... done successfully.
    
    
    
     Executing test function test.convert_POSIXct2POSIXct ... done successfully.
    
    
    
     Executing test function test.convert_POSIXct2chron ... done successfully.
    
    
    
     Executing test function test.convert_POSIXct2timeDate ... done successfully.
    
    
    
     Executing test function test.convert_POSIXct2yearmon ... done successfully.
    
    
    
     Executing test function test.convert_POSIXct2yearqtr ... done successfully.
    
    
    
     Executing test function test.convert_chron2Date ... done successfully.
    
    
    
     Executing test function test.convert_chron2POSIXct ... done successfully.
    
    
    
     Executing test function test.convert_chron2chron ... done successfully.
    
    
    
     Executing test function test.convert_chron2timeDate ... done successfully.
    
    
    
     Executing test function test.convert_chron2yearmon ... done successfully.
    
    
    
     Executing test function test.convert_chron2yearqtr ... done successfully.
    
    
    
     Executing test function test.convert_timeDate2Date ... done successfully.
    
    
    
     Executing test function test.convert_timeDate2POSIXct ... done successfully.
    
    
    
     Executing test function test.convert_timeDate2chron ... done successfully.
    
    
    
     Executing test function test.convert_timeDate2timeDate ... done successfully.
    
    
    
     Executing test function test.convert_timeDate2yearmon ... done successfully.
    
    
    
     Executing test function test.convert_timeDate2yearqtr ... done successfully.
    
    
    
     Executing test function test.convert_yearmon2Date ... done successfully.
    
    
    
     Executing test function test.convert_yearmon2POSIXct ... done successfully.
    
    
    
     Executing test function test.convert_yearmon2chron ... done successfully.
    
    
    
     Executing test function test.convert_yearmon2timeDate ... done successfully.
    
    
    
     Executing test function test.convert_yearmon2yearmon ... done successfully.
    
    
    
     Executing test function test.convert_yearmon2yearqtr ... done successfully.
    
    
    
     Executing test function test.convert_yearqtr2Date ... done successfully.
    
    
    
     Executing test function test.convert_yearqtr2POSIXct ... done successfully.
    
    
    
     Executing test function test.convert_yearqtr2chron ... done successfully.
    
    
    
     Executing test function test.convert_yearqtr2timeDate ... done successfully.
    
    
    
     Executing test function test.convert_yearqtr2yearmon ... done successfully.
    
    
    
     Executing test function test.convert_yearqtr2yearqtr ... done successfully.
    
    
    
     Executing test function test.indexClass_NULL ... Error in `tclass<-.xts`(x, value) : improperly specified value for tclass
     In addition: There were 50 or more warnings (use warnings() to see the first 50)
     done successfully.
    
    
    
     Executing test function test.indexClass_empty_string ... Error in `tclass<-.xts`(x, value) : unsupported 'tclass' indexing type:
     In addition: Warning message:
     'indexClass<-' is deprecated.
     Use 'tclass<-' instead.
     See help("Deprecated") and help("xts-deprecated").
     done successfully.
    
    
    
     Executing test function test.indexClass_full_index ... Error in `tclass<-.xts`(x, value) : improperly specified value for tclass
     In addition: Warning message:
     'indexClass<-' is deprecated.
     Use 'tclass<-' instead.
     See help("Deprecated") and help("xts-deprecated").
     done successfully.
    
    
    
     Executing test function test.indexClass_missing_object ... Error in eval(expr, envir = parent.frame()) : object 'Date' not found
     In addition: Warning message:
     In rm(Date) : object 'Date' not found
     done successfully.
    
    
    
     Executing test function test.indexClass_unquoted_symbol ... Error in h(simpleError(msg, call)) :
     error in evaluating the argument 'i' in selecting a method for function '[': 'match' requires vector arguments
     In addition: Warning message:
     'indexClass<-' is deprecated.
     Use 'tclass<-' instead.
     See help("Deprecated") and help("xts-deprecated").
     done successfully.
    
    
    
     Executing test function test.convert_irts_to_xts ... done successfully.
    
    
    
     Executing test function test.convert_irts_to_xts_i1 ... done successfully.
    
    
    
     Executing test function test.convert_irts_to_xts_i1j1 ... done successfully.
    
    
    
     Executing test function test.convert_irts_to_xts_j1 ... done successfully.
    
    
    
     Executing test function test.isOrdered_decr ... done successfully.
    
    
    
     Executing test function test.isOrdered_decr_begNA ... done successfully.
    
    
    
     Executing test function test.isOrdered_decr_endNA ... done successfully.
    
    
    
     Executing test function test.isOrdered_decr_midNA ... done successfully.
    
    
    
     Executing test function test.isOrdered_incr ... done successfully.
    
    
    
     Executing test function test.isOrdered_incr_begNA ... done successfully.
    
    
    
     Executing test function test.isOrdered_incr_endNA ... done successfully.
    
    
    
     Executing test function test.isOrdered_incr_midNA ... done successfully.
    
    
    
     Executing test function test.lag_integer_Date ... done successfully.
    
    
    
     Executing test function test.lag_integer_POSIXt ... done successfully.
    
    
    
     Executing test function test.lag_k_NA ... done successfully.
    
    
    
     Executing test function test.lag_k_zero_length ... done successfully.
    
    
    
     Executing test function test.lag_logical_Date ... done successfully.
    
    
    
     Executing test function test.lag_logical_POSIXt ... done successfully.
    
    
    
     Executing test function test.lag_numeric_Date ... done successfully.
    
    
    
     Executing test function test.lag_numeric_POSIXt ... done successfully.
    
    
    
     Executing test function test.convert_matrix_to_xts ... done successfully.
    
    
    
     Executing test function test.convert_matrix_to_xts_i1 ... done successfully.
    
    
    
     Executing test function test.convert_matrix_to_xts_i1j1 ... done successfully.
    
    
    
     Executing test function test.convert_matrix_to_xts_j1 ... done successfully.
    
    
    
     Executing test function test.dimless_xts_to_matrix ... done successfully.
    
    
    
     Executing test function test.matrix_reclass ... done successfully.
    
    
    
     Executing test function test.matrix_reclass_subset_as.xts_j1 ... done successfully.
    
    
    
     Executing test function test.matrix_reclass_subset_matrix_j1 ... done successfully.
    
    
    
     Executing test function test.matrix_reclass_subset_reclass_j1 ... done successfully.
    
    
    
     Executing test function test.zero_width_xts_to_matrix ... done successfully.
    
    
    
     Executing test function test.check_names_false ... done successfully.
    
    
    
     Executing test function test.merge_empty_xts_with_2_scalars ... done successfully.
    
    
    
     Executing test function test.merge_fill_NULL ... done successfully.
    
    
    
     Executing test function test.merge_fill_zero_length ... done successfully.
    
    
    
     Executing test function test.merge_index_contains_Inf ... done successfully.
    
    
    
     Executing test function test.merge_index_contains_NA_double ... done successfully.
    
    
    
     Executing test function test.merge_index_contains_NA_integer ... done successfully.
    
    
    
     Executing test function test.merge_index_contains_NaN ... done successfully.
    
    
    
     Executing test function test.merge_more_than_2_zero_width_objects ... done successfully.
    
    
    
     Executing test function test.merge_with_zero_width_returns_original_type ... done successfully.
    
    
    
     Executing test function test.n_way_merge_on_all_types ... done successfully.
    
    
    
     Executing test function test.shorter_colnames_for_unnamed_args ... done successfully.
    
    
    
     Executing test function test.nalocf ... done successfully.
    
    
    
     Executing test function test.nalocf_by_column ... done successfully.
    
    
    
     Executing test function test.nalocf_by_column_1NA ... done successfully.
    
    
    
     Executing test function test.nalocf_by_column_1NA_fromLast ... done successfully.
    
    
    
     Executing test function test.nalocf_by_column_fromLast ... done successfully.
    
    
    
     Executing test function test.nalocf_by_column_leading_NA ... done successfully.
    
    
    
     Executing test function test.nalocf_by_column_x ... done successfully.
    
    
    
     Executing test function test.nalocf_by_column_xout ... done successfully.
    
    
    
     Executing test function test.nalocf_first_column_all_NA ... done successfully.
    
    
    
     Executing test function test.nalocf_fromLast ... done successfully.
    
    
    
     Executing test function test.nalocf_last_column_all_NA ... done successfully.
    
    
    
     Executing test function test.nalocf_leading_NA ... done successfully.
    
    
    
     Executing test function test.nalocf_x ... done successfully.
    
    
    
     Executing test function test.nalocf_xout ... done successfully.
    
    
    
     Executing test function test.naomit ... done successfully.
    
    
    
     Executing test function test.naomit_by_column ... done successfully.
    
    
    
     Executing test function test.all_dates ... done successfully.
    
    
    
     Executing test function test.end_date_is_garbage ... done successfully.
    
    
    
     Executing test function test.left_open_to_end ... done successfully.
    
    
    
     Executing test function test.single_date ... done successfully.
    
    
    
     Executing test function test.single_date_is_garbage ... done successfully.
    
    
    
     Executing test function test.start_date_is_garbage ... done successfully.
    
    
    
     Executing test function test.start_end_dates_are_garbage ... done successfully.
    
    
    
     Executing test function test.start_end_dates_do_not_exist ... done successfully.
    
    
    
     Executing test function test.start_to_right_open ... done successfully.
    
    
    
     Executing test function test.INDEX_ends_with_lengthX ... done successfully.
    
    
    
     Executing test function test.INDEX_ends_with_lengthX_vector ... done successfully.
    
    
    
     Executing test function test.INDEX_starts_with_zero ... done successfully.
    
    
    
     Executing test function test.INDEX_starts_with_zero_vector ... done successfully.
    
    
    
     Executing test function test.duplicate_INDEX ... done successfully.
    
    
    
     Executing test function test.duplicate_INDEX_vector ... done successfully.
    
    
    
     Executing test function test.intraday_to_daily ... done successfully.
    
    
    
     Executing test function test.period.max_converts_index_to_integer ... done successfully.
    
    
    
     Executing test function test.period.max_equals_apply.monthly ... done successfully.
    
    
    
     Executing test function test.period.min_converts_index_to_integer ... done successfully.
    
    
    
     Executing test function test.period.min_equals_apply.monthly ... done successfully.
    
    
    
     Executing test function test.period.prod_converts_index_to_integer ... done successfully.
    
    
    
     Executing test function test.period.prod_equals_apply.monthly ... done successfully.
    
    
    
     Executing test function test.period.sum_converts_index_to_integer ... done successfully.
    
    
    
     Executing test function test.period.sum_equals_apply.monthly ... done successfully.
    
    
    
     Executing test function test.unsorted_INDEX ... done successfully.
    
    
    
     Executing test function test.unsorted_INDEX_vector ... done successfully.
    
    
    
     Executing test function test.periodicity_on_one_observation_warns ... Error in periodicity(x) :
     (converted from warning) can not calculate periodicity of 1 observation
     In addition: There were 34 warnings (use warnings() to see them)
     done successfully.
    
    
    
     Executing test function test.periodicity_on_zero_observations_warns ... Error in periodicity(x) :
     (converted from warning) can not calculate periodicity of empty object
     In addition: Warning message:
     In periodicity(x) : can not calculate periodicity of empty object
     done successfully.
    
    
    
     Executing test function test.axTicksByTime_ticks.on_quarter ... done successfully.
    
    
    
     Executing test function test.format_xts_yearqtr ... done successfully.
    
    
    
     Executing test function test.format_zoo_yearqtr ... done successfully.
    
    
    
     Executing test function test.reclass_preserves_match.to_tclass ... done successfully.
    
    
    
     Executing test function test.reclass_preserves_match.to_tformat ... done successfully.
    
    
    
     Executing test function test.reclass_preserves_match.to_tzone ... done successfully.
    
    
    
     Executing test function test.split_character_f_not_endpoints ... done successfully.
    
    
    
     Executing test function test.time_of_day_by_hour_start_equals_end ... done successfully.
    
    
    
     Executing test function test.time_of_day_by_minute ... done successfully.
    
    
    
     Executing test function test.time_of_day_by_second ... done successfully.
    
    
    
     Executing test function test.time_of_day_check_time_string ... done successfully.
    
    
    
     Executing test function test.time_of_day_end_before_start ... done successfully.
    
    
    
     Executing test function test.time_of_day_on_zero_width ... done successfully.
    
    
    
     Executing test function test.time_of_day_start_equals_end ... done successfully.
    
    
    
     Executing test function test.time_of_day_when_DST_ends ... done successfully.
    
    
    
     Executing test function test.time_of_day_when_DST_starts ... done successfully.
    
    
    
     Executing test function test.time_of_day_zero_padding ... Error : Supply time-of-day subsetting in the format of T%H:%M:%OS/T%H:%M:%OS
     In addition: Warning messages:
     1: In RNGkind(kind = testSuite$rngKind, normal.kind = testSuite$rngNormalKind) :
     RNGkind: Marsaglia-Multicarry has poor statistical properties
     2: In RNGkind(kind = testSuite$rngKind, normal.kind = testSuite$rngNormalKind) :
     RNGkind: severe deviations from normality for Kinderman-Ramage + Marsaglia-Multicarry
     3: In RNGkind(kind = testSuite$rngKind, normal.kind = testSuite$rngNormalKind) :
     RNGkind: Marsaglia-Multicarry has poor statistical properties
     4: In RNGkind(kind = testSuite$rngKind, normal.kind = testSuite$rngNormalKind) :
     RNGkind: severe deviations from normality for Kinderman-Ramage + Marsaglia-Multicarry
     5: In RNGkind(kind = testSuite$rngKind, normal.kind = testSuite$rngNormalKind) :
     RNGkind: Marsaglia-Multicarry has poor statistical properties
     6: In RNGkind(kind = testSuite$rngKind, normal.kind = testSuite$rngNormalKind) :
     RNGkind: severe deviations from normality for Kinderman-Ramage + Marsaglia-Multicarry
     7: In RNGkind(kind = testSuite$rngKind, normal.kind = testSuite$rngNormalKind) :
     RNGkind: Marsaglia-Multicarry has poor statistical properties
     8: In RNGkind(kind = testSuite$rngKind, normal.kind = testSuite$rngNormalKind) :
     RNGkind: severe deviations from normality for Kinderman-Ramage + Marsaglia-Multicarry
     Error : Supply time-of-day subsetting in the format of T%H:%M:%OS/T%H:%M:%OS
     done successfully.
    
    
    
     Executing test function test.duplicate_index_duplicate_i ... done successfully.
    
    
    
     Executing test function test.empty_i_NA ... done successfully.
    
    
    
     Executing test function test.empty_i_NULL ... done successfully.
    
    
    
     Executing test function test.empty_i_datetime ... done successfully.
    
    
    
     Executing test function test.empty_i_negative ... done successfully.
    
    
    
     Executing test function test.empty_i_zero ... done successfully.
    
    
    
     Executing test function test.i_0 ... done successfully.
    
    
    
     Executing test function test.i_Date ... done successfully.
    
    
    
     Executing test function test.i_POSIXct ... done successfully.
    
    
    
     Executing test function test.i_POSIXlt ... done successfully.
    
    
    
     Executing test function test.i_asis_character ... done successfully.
    
    
    
     Executing test function test.i_character ... done successfully.
    
    
    
     Executing test function test.i_date_range_open_end ... done successfully.
    
    
    
     Executing test function test.i_date_range_open_start ... done successfully.
    
    
    
     Executing test function test.i_integer_j_NA_has_colnames ... done successfully.
    
    
    
     Executing test function test.i_integer_j_NA_no_colnames ... done successfully.
    
    
    
     Executing test function test.i_invalid_date_string ... done successfully.
    
    
    
     Executing test function test.i_missing_j_NA_has_colnames ... done successfully.
    
    
    
     Executing test function test.i_missing_j_NA_no_colnames ... done successfully.
    
    
    
     Executing test function test.i_only_range_separator_or_empty_string ... done successfully.
    
    
    
     Executing test function test.get_coredata_drops_xts_tclass_indexCLASS ... done successfully.
    
    
    
     Executing test function test.get_indexClass_warns ... Error : (converted from warning) 'indexClass' is deprecated.
     Use 'tclass' instead.
     See help("Deprecated") and help("xts-deprecated").
     In addition: Warning messages:
     1: In RNGkind(kind = testSuite$rngKind, normal.kind = testSuite$rngNormalKind) :
     RNGkind: Marsaglia-Multicarry has poor statistical properties
     2: In RNGkind(kind = testSuite$rngKind, normal.kind = testSuite$rngNormalKind) :
     RNGkind: severe deviations from normality for Kinderman-Ramage + Marsaglia-Multicarry
     3: In .parseISO8601(ii, .index(x)[1], .index(x)[nr], tz = tz) :
     cannot determine first and last time from 2012-02-30/2012-02-30
     4: In RNGkind(kind = testSuite$rngKind, normal.kind = testSuite$rngNormalKind) :
     RNGkind: Marsaglia-Multicarry has poor statistical properties
     5: In RNGkind(kind = testSuite$rngKind, normal.kind = testSuite$rngNormalKind) :
     RNGkind: severe deviations from normality for Kinderman-Ramage + Marsaglia-Multicarry
     done successfully.
    
    
    
     Executing test function test.get_tclass ... done successfully.
    
    
    
     Executing test function test.get_xtsAttributes_excludes_tclass_indexCLASS ... done successfully.
    
    
    
     Executing test function test.set_indexClass_warns ... Error : (converted from warning) 'indexClass<-' is deprecated.
     Use 'tclass<-' instead.
     See help("Deprecated") and help("xts-deprecated").
     done successfully.
    
    
    
     Executing test function test.set_tclass_changes_index_tclass ... done successfully.
    
    
    
     Executing test function test.set_tclass_drops_xts_tclass_indexCLASS ... done successfully.
    
    
    
     Executing test function test.set_xtsAttributes_removes_tclass_indexClass ... done successfully.
    
    
    
     Executing test function test.get_coredata_drops_xts_indexFORMAT ... done successfully.
    
    
    
     Executing test function test.get_indexFORMAT_warns ... Error : (converted from warning) 'indexFormat' is deprecated.
     Use 'tformat' instead.
     See help("Deprecated") and help("xts-deprecated").
     In addition: Warning messages:
     1: In RNGkind(kind = testSuite$rngKind, normal.kind = testSuite$rngNormalKind) :
     RNGkind: Marsaglia-Multicarry has poor statistical properties
     2: In RNGkind(kind = testSuite$rngKind, normal.kind = testSuite$rngNormalKind) :
     RNGkind: severe deviations from normality for Kinderman-Ramage + Marsaglia-Multicarry
     done successfully.
    
    
    
     Executing test function test.get_tformat ... done successfully.
    
    
    
     Executing test function test.get_xtsAttributes_excludes_indexFORMAT ... done successfully.
    
    
    
     Executing test function test.set_indexFORMAT_warns ... Error : (converted from warning) 'indexFormat<-' is deprecated.
     Use 'tformat<-' instead.
     See help("Deprecated") and help("xts-deprecated").
     done successfully.
    
    
    
     Executing test function test.set_tformat_changes_index_tformat ... done successfully.
    
    
    
     Executing test function test.set_tformat_drops_xts_indexFORMAT ... done successfully.
    
    
    
     Executing test function test.set_xtsAttributes_removes_indexFORMAT ... done successfully.
    
    
    
     Executing test function test.tbs_199901_to_200801_by_month ... done successfully.
    
    
    
     Executing test function test.tbs_199901_to_200801_by_month_Date ... done successfully.
    
    
    
     Executing test function test.tbs_199901_to_200801_by_month_POSIXct ... done successfully.
    
    
    
     Executing test function test.tbs_199901_to_2008_by_month ... done successfully.
    
    
    
     Executing test function test.tbs_199901_to_2008_by_month_Date ... done successfully.
    
    
    
     Executing test function test.tbs_199901_to_2008_by_month_POSIXct ... done successfully.
    
    
    
     Executing test function test.tbs_1999_to_200801_by_month ... done successfully.
    
    
    
     Executing test function test.tbs_1999_to_200801_by_month_Date ... done successfully.
    
    
    
     Executing test function test.tbs_1999_to_200801_by_month_POSIXct ... done successfully.
    
    
    
     Executing test function test.tbs_1999_to_2008_by_year ... done successfully.
    
    
    
     Executing test function test.tbs_1999_to_2008_by_year_Date ... done successfully.
    
    
    
     Executing test function test.tbs_1999_to_2008_by_year_retclassDate ... done successfully.
    
    
    
     Executing test function test.convert_timeSeries.univariate_to_xts ... done successfully.
    
    
    
     Executing test function test.convert_timeSeries.univariate_to_xts_i1 ... done successfully.
    
    
    
     Executing test function test.convert_timeSeries.univariate_to_xts_i1j1 ... done successfully.
    
    
    
     Executing test function test.convert_timeSeries.univariate_to_xts_j1 ... done successfully.
    
    
    
     Executing test function test.convert_timeSeries_to_xts ... done successfully.
    
    
    
     Executing test function test.convert_timeSeries_to_xts_i1 ... done successfully.
    
    
    
     Executing test function test.convert_timeSeries_to_xts_i1j1 ... done successfully.
    
    
    
     Executing test function test.convert_timeSeries_to_xts_j1 ... done successfully.
    
    
    
     Executing test function test.timeSeries_reclass ... done successfully.
    
    
    
     Executing test function test.timeSeries_reclass_subset_as.xts_j1 ... done successfully.
    
    
    
     Executing test function test.timeSeries_reclass_subset_reclass_j1 ... done successfully.
    
    
    
     Executing test function test.timeSeries_reclass_subset_timeSeries_j1 ... done successfully.
    
    
    
     Executing test function test.to.frequency_includes_first_group ... done successfully.
    
    
    
     Executing test function test.convert_ts12_to_xts ... done successfully.
    
    
    
     Executing test function test.convert_ts12_to_xts_i1 ... done successfully.
    
    
    
     Executing test function test.convert_ts12_to_xts_i1j1 ... done successfully.
    
    
    
     Executing test function test.convert_ts12_to_xts_j1 ... done successfully.
    
    
    
     Executing test function test.convert_ts4_to_xts ... done successfully.
    
    
    
     Executing test function test.convert_ts4_to_xts_i1 ... done successfully.
    
    
    
     Executing test function test.convert_ts4_to_xts_i1j1 ... done successfully.
    
    
    
     Executing test function test.convert_ts4_to_xts_j1 ... done successfully.
    
    
    
     Executing test function test.convert_ts_to_xts ... done successfully.
    
    
    
     Executing test function test.convert_ts_to_xts_i1 ... done successfully.
    
    
    
     Executing test function test.convert_ts_to_xts_i1j1 ... done successfully.
    
    
    
     Executing test function test.convert_ts_to_xts_j1 ... done successfully.
    
    
    
     Executing test function test.ts12_reclass ... done successfully.
    
    
    
     Executing test function test.ts12_reclass_subset_as.xts_j1 ... done successfully.
    
    
    
     Executing test function test.ts12_reclass_subset_reclass_j1 ... done successfully.
    
    
    
     Executing test function test.ts12_reclass_subset_ts_j1 ... done successfully.
    
    
    
     Executing test function test.ts4_reclass ... done successfully.
    
    
    
     Executing test function test.ts4_reclass_subset_as.xts_j1 ... done successfully.
    
    
    
     Executing test function test.ts4_reclass_subset_reclass_j1 ... done successfully.
    
    
    
     Executing test function test.ts4_reclass_subset_ts_j1 ... done successfully.
    
    
    
     Executing test function test.ts_reclass ... done successfully.
    
    
    
     Executing test function test.ts_reclass_subset_as.xts_j1 ... done successfully.
    
    
    
     Executing test function test.ts_reclass_subset_reclass_j1 ... done successfully.
    
    
    
     Executing test function test.ts_reclass_subset_ts_j1 ... done successfully.
    
    
    
     Executing test function test.get_coredata_drops_xts_tzone_indexTZ ... done successfully.
    
    
    
     Executing test function test.get_indexTZ_warns ... Error : (converted from warning) 'indexTZ' is deprecated.
     Use 'tzone' instead.
     See help("Deprecated") and help("xts-deprecated").
     In addition: Warning messages:
     1: In RNGkind(kind = testSuite$rngKind, normal.kind = testSuite$rngNormalKind) :
     RNGkind: Marsaglia-Multicarry has poor statistical properties
     2: In RNGkind(kind = testSuite$rngKind, normal.kind = testSuite$rngNormalKind) :
     RNGkind: severe deviations from normality for Kinderman-Ramage + Marsaglia-Multicarry
     3: In RNGkind(kind = testSuite$rngKind, normal.kind = testSuite$rngNormalKind) :
     RNGkind: Marsaglia-Multicarry has poor statistical properties
     4: In RNGkind(kind = testSuite$rngKind, normal.kind = testSuite$rngNormalKind) :
     RNGkind: severe deviations from normality for Kinderman-Ramage + Marsaglia-Multicarry
     5: In RNGkind(kind = testSuite$rngKind, normal.kind = testSuite$rngNormalKind) :
     RNGkind: Marsaglia-Multicarry has poor statistical properties
     6: In RNGkind(kind = testSuite$rngKind, normal.kind = testSuite$rngNormalKind) :
     RNGkind: severe deviations from normality for Kinderman-Ramage + Marsaglia-Multicarry
     7: In RNGkind(kind = testSuite$rngKind, normal.kind = testSuite$rngNormalKind) :
     RNGkind: Marsaglia-Multicarry has poor statistical properties
     8: In RNGkind(kind = testSuite$rngKind, normal.kind = testSuite$rngNormalKind) :
     RNGkind: severe deviations from normality for Kinderman-Ramage + Marsaglia-Multicarry
     9: In RNGkind(kind = testSuite$rngKind, normal.kind = testSuite$rngNormalKind) :
     RNGkind: Marsaglia-Multicarry has poor statistical properties
     10: In RNGkind(kind = testSuite$rngKind, normal.kind = testSuite$rngNormalKind) :
     RNGkind: severe deviations from normality for Kinderman-Ramage + Marsaglia-Multicarry
     done successfully.
    
    
    
     Executing test function test.get_tzone ... done successfully.
    
    
    
     Executing test function test.get_xtsAttributes_excludes_tzone_indexTZ ... done successfully.
    
    
    
     Executing test function test.set_indexTZ_warns ... Error : (converted from warning) 'indexTZ<-' is deprecated.
     Use 'tzone<-' instead.
     See help("Deprecated") and help("xts-deprecated").
     done successfully.
    
    
    
     Executing test function test.set_tzone_changes_index_tzone ... done successfully.
    
    
    
     Executing test function test.set_tzone_drops_xts_tzone_indexTZ ... done successfully.
    
    
    
     Executing test function test.set_tzone_to_NULL_sets_empty_string ... done successfully.
    
    
    
     Executing test function test.set_xtsAttributes_removes_tzone_indexTZ ... done successfully.
    
    
    
     Executing test function test..xts_ctor_does_not_return_rownames ... done successfully.
    
    
    
     Executing test function test..xts_dimnames_in_dots ... done successfully.
    
    
    
     Executing test function test..xts_index_class_precedence ... done successfully.
    
    
    
     Executing test function test..xts_index_format_precedence ... done successfully.
    
    
    
     Executing test function test..xts_index_tzone_precedence ... done successfully.
    
    
    
     Executing test function test..xts_order.by_Inf_double ... Error in .xts(1:3, c(1, 2, Inf)) :
     'index' cannot contain 'NA', 'NaN', or 'Inf'
     In addition: There were 14 warnings (use warnings() to see them)
     Error in .xts(1:3, c(-Inf, 2, 3)) :
     'index' cannot contain 'NA', 'NaN', or 'Inf'
     done successfully.
    
    
    
     Executing test function test..xts_order.by_NA_double ... Error in .xts(1:3, c(1, 2, NA)) :
     'index' cannot contain 'NA', 'NaN', or 'Inf'
     Error in .xts(1:3, c(NA, 2, 3)) :
     'index' cannot contain 'NA', 'NaN', or 'Inf'
     Error in .xts(1:3, c(1, NA, 3)) :
     'index' cannot contain 'NA', 'NaN', or 'Inf'
     done successfully.
    
    
    
     Executing test function test..xts_order.by_NA_integer ... Error in .xts(1:3, c(1L, 2L, NA)) :
     'index' cannot contain 'NA', 'NaN', or 'Inf'
     Error in .xts(1:3, c(NA, 2L, 3L)) : index is not in increasing order
     Error in .xts(1:3, c(1L, NA, 3L)) : index is not in increasing order
     done successfully.
    
    
    
     Executing test function test..xts_order.by_NaN_double ... Error in .xts(1:3, c(1, 2, NaN)) :
     'index' cannot contain 'NA', 'NaN', or 'Inf'
     Error in .xts(1:3, c(NaN, 2, 3)) :
     'index' cannot contain 'NA', 'NaN', or 'Inf'
     Error in .xts(1:3, c(1, NaN, 3)) :
     'index' cannot contain 'NA', 'NaN', or 'Inf'
     done successfully.
    
    
    
     Executing test function test..xts_user_attributes ... done successfully.
    
    
    
     Executing test function test.ctors_dont_add_indexFORMAT_to_object ... done successfully.
    
    
    
     Executing test function test.ctors_dont_add_tclass_indexCLASS_to_object ... done successfully.
    
    
    
     Executing test function test.ctors_dont_add_tzone_indexTZ_to_object ... done successfully.
    
    
    
     Executing test function test.xts_ctor_warns_for_indexCLASS_arg ... Error in xts(1, as.Date("2018-05-02"), .indexCLASS = "Date") :
     (converted from warning) '.indexCLASS' is deprecated, use tclass instead.
     In addition: Warning messages:
     1: In .xts(1, 1, tformat = "%Y", .indexCLASS = "Date", .indexTZ = "UTC", :
     '.indexCLASS' is deprecated, use tclass instead.
     2: In .xts(1, 1, tformat = "%Y", .indexCLASS = "Date", .indexTZ = "UTC", :
     '.indexTZ' is deprecated and will be ignored, use tzone instead.
     Error in .xts(1, as.Date("2018-05-02"), .indexCLASS = "Date") :
     (converted from warning) '.indexCLASS' is deprecated, use tclass instead.
     done successfully.
    
    
    
     Executing test function test.xts_ctor_warns_for_indexFORMAT_arg ... Error in xts(1, as.Date("2018-05-02"), .indexFORMAT = "%Y") :
     (converted from warning) '.indexFORMAT' is deprecated, use tformat instead.
     Error in .xts(1, as.Date("2018-05-02"), .indexFORMAT = "%Y") :
     (converted from warning) '.indexFORMAT' is deprecated, use tformat instead.
     done successfully.
    
    
    
     Executing test function test.xts_ctor_warns_for_indexTZ_arg ... Error in xts(1, as.Date("2018-05-02"), .indexTZ = "UTC") :
     (converted from warning) '.indexTZ' is deprecated, use tzone instead.
     Error in .xts(1, as.Date("2018-05-02"), .indexTZ = "UTC") :
     (converted from warning) '.indexTZ' is deprecated and will be ignored, use tzone instead.
     done successfully.
    
    
    
     Executing test function test.xts_no_args_has_index_with_tzone_tclass ... done successfully.
    
    
    
     Executing test function test.xts_only_use_first_tzone_element ... done successfully.
    
    
    
     Executing test function test.xts_order.by_Inf_double ... Error in xts(1:3, .POSIXct(c(1, 2, Inf))) :
     'order.by' cannot contain 'NA', 'NaN', or 'Inf'
     Error in xts(1:3, .POSIXct(c(-Inf, 2, 3))) :
     'order.by' cannot contain 'NA', 'NaN', or 'Inf'
     done successfully.
    
    
    
     Executing test function test.xts_order.by_NA_double ... Error in xts(1:3, .POSIXct(c(1, 2, NA))) :
     'order.by' cannot contain 'NA', 'NaN', or 'Inf'
     Error in xts(1:3, .POSIXct(c(NA, 2, 3))) :
     'order.by' cannot contain 'NA', 'NaN', or 'Inf'
     Error in xts(1:3, .POSIXct(c(1, NA, 3))) :
     'order.by' cannot contain 'NA', 'NaN', or 'Inf'
     done successfully.
    
    
    
     Executing test function test.xts_order.by_NA_integer ... Error in xts(1:3, as.Date(c(1L, 2L, NA), origin = "1970-01-01")) :
     'order.by' cannot contain 'NA', 'NaN', or 'Inf'
     Error in xts(1:3, as.Date(c(NA, 2L, 3L), origin = "1970-01-01")) :
     'order.by' cannot contain 'NA', 'NaN', or 'Inf'
     Error in xts(1:3, as.Date(c(1L, NA, 3L), origin = "1970-01-01")) :
     'order.by' cannot contain 'NA', 'NaN', or 'Inf'
     done successfully.
    
    
    
     Executing test function test.xts_order.by_NaN_double ... Error in xts(1:3, .POSIXct(c(1, 2, NaN))) :
     'order.by' cannot contain 'NA', 'NaN', or 'Inf'
     Error in xts(1:3, .POSIXct(c(NaN, 2, 3))) :
     'order.by' cannot contain 'NA', 'NaN', or 'Inf'
     Error in xts(1:3, .POSIXct(c(1, NaN, 3))) :
     'order.by' cannot contain 'NA', 'NaN', or 'Inf'
     done successfully.
    
    
    
     Executing test function test.as.Date.numeric ... done successfully.
    
    
    
     Executing test function test.rbind_zero_length_non_zero_length_Date_errors ... done successfully.
    
    
    
     Executing test function test.rbind_zero_length_non_zero_length_POSIXct_errors ... done successfully.
    
    
    
     Executing test function test.subset_i_ISO8601 ... done successfully.
    
    
    
     Executing test function test.subset_i_datetime_or_character ... done successfully.
    
    
    
     Executing test function test.window ... Timing stopped at: 0.02 0 0.02
     Error in checkIdentical(bin, reg, "Range over gap") : FALSE
     Range over gap
     In addition: Warning messages:
     1: In RNGkind(kind = testSuite$rngKind, normal.kind = testSuite$rngNormalKind) :
     RNGkind: Marsaglia-Multicarry has poor statistical properties
     2: In RNGkind(kind = testSuite$rngKind, normal.kind = testSuite$rngNormalKind) :
     RNGkind: severe deviations from normality for Kinderman-Ramage + Marsaglia-Multicarry
     done successfully.
    
    
    
     Executing test function test.convert_zoo_to_xts ... done successfully.
    
    
    
     Executing test function test.convert_zoo_to_xts_i1 ... done successfully.
    
    
    
     Executing test function test.convert_zoo_to_xts_i1j1 ... done successfully.
    
    
    
     Executing test function test.convert_zoo_to_xts_j1 ... done successfully.
    
    
    
     Executing test function test.zoo_reclass_subset_as.xts_j1 ... done successfully.
    
    
    
     Executing test function test.zoo_reclass_subset_zoo_j1 ... done successfully.
    
     ------------------- UNIT TEST SUMMARY ---------------------
    
     RUNIT TEST PROTOCOL -- Sun Sep 19 15:14:54 2021
     ***********************************************
     Number of test functions: 432
     Number of errors: 0
     Number of failures: 1
    
    
     1 Test Suite :
     xts unit testing - 432 test functions, 0 errors, 1 failure
     FAILURE in test.window: Error in checkIdentical(bin, reg, "Range over gap") : FALSE
     Range over gap
     Error:
    
     unit testing failed (#test failures: 1, #R errors: 0)
    
     In addition: Warning messages:
     1: In RNGkind(kind = testSuite$rngKind, normal.kind = testSuite$rngNormalKind) :
     RNGkind: Marsaglia-Multicarry has poor statistical properties
     2: In RNGkind(kind = testSuite$rngKind, normal.kind = testSuite$rngNormalKind) :
     RNGkind: severe deviations from normality for Kinderman-Ramage + Marsaglia-Multicarry
     Execution halted
Flavor: r-devel-windows-x86_64

Version: 0.12.1
Check: whether package can be installed
Result: ERROR
    Installation failed.
Flavor: r-devel-windows-x86_64-gcc10-UCRT